{"text_format":"1","workbook":"xlsx","n_sheets":13,"sheets":["Summary_BU","VHid","Site","D.A. A","D.A. B","D.A. C","D.A. D","D.A. E","Water Quality Compliance","Runoff Volume and CN","Summary","Constants","Notes"],"not_rendered":{"charts":0,"images":0,"macros":1,"external_links":0,"defined_names":2,"comments":5,"pivot_tables":0},"unopened":[],"bounds":{"document_bytes":16777216,"sheet_cells":100000,"rows_first":2000,"rows_last":500,"rows_between":2000,"halvings":0,"cell_chars":16384,"cell_head_chars":4096},"cells_cut":0,"cells_raw":0,"read":"whole","date_system":"1900"}

{"sheet":"Summary_BU","index":0,"n_rows":192,"n_cols":11,"rows_kept":192,"cut":false,"hidden":true,"merged":[[5,8,8,9],[6,2,6,3],[27,2,27,3],[28,2,28,3],[29,2,29,3],[7,2,7,3],[48,1,48,2],[183,1,185,1],[186,1,188,1],[189,1,191,1],[4,1,4,4],[5,1,5,4],[30,2,30,3],[32,2,32,3],[34,2,34,5],[35,2,35,5],[39,1,40,2],[39,3,40,3]]}
[]
[null,{"$f":"Site!E1","v":"DEQ Virginia Runoff Reduction Method Re-Development Compliance Spreadsheet  - Version 4.1 "}]
[]
[null,{"$f":"Site!G11","v":"BMP Design Specifications List:"},{"$f":"Site!J11","v":"2024 Stds & Specs"}]
[null,{"$f":"IF(Site!E6=\"Yes\",\"Site Summary - Linear Development Project***\",\"Site Summary\")","v":"Site Summary"}]
[null,{"$f":"IF(Site!B4=\"\",\"Project Title: NA\",\"Project Title: \" &Site!B4)","v":"Project Title: NA"}]
[null,{"$f":"IF(Site!B5=\"\",\"Date: NA\",\"Date: \" &Site!B5)","v":"Date: NA"}]
[null,null,"Total Disturbed Acreage: ",null,{"$f":"Site!F10","v":0}]
[]
[null,"Site Land Cover Summary",{"$f":"IF(Site!G10=\"←\", \"DISTURBED ACREAGE NOT ENTERED ON SITE TAB!\",IF(Site!F10>Site!F29,\"TOTAL DISTURBED ACREAGE GREATER THAN POST-DEVELOPMENT AREA IN SITE TAB!\",\"\"))","v":""}]
[]
[null,"Pre-ReDevelopment Land Cover  (acres)"]
[null,null,"A soils","B Soils","C Soils","D Soils","Totals","% of Total"]
[null,"Forest (acres)",{"$f":"Site!B17","v":0},{"$f":"Site!C17","v":0},{"$f":"Site!D17","v":0},{"$f":"Site!E17","v":0},{"$f":"Site!F17","v":0},{"$f":"IF(G$18>0,G14/G$18*100,0)","v":0}]
[null,"Mixed Open (acres)",{"$f":"Site!B18","v":0},{"$f":"Site!C18","v":0},{"$f":"Site!D18","v":0},{"$f":"Site!E18","v":0},{"$f":"Site!F18","v":0},{"$f":"IF(G$18>0,G15/G$18*100,0)","v":0}]
[null,"Managed Turf (acres)",{"$f":"Site!B19","v":0},{"$f":"Site!C19","v":0},{"$f":"Site!D19","v":0},{"$f":"Site!E19","v":0},{"$f":"Site!F19","v":0},{"$f":"IF(G$18>0,G16/G$18*100,0)","v":0}]
[null,"Impervious Cover (acres)",{"$f":"Site!B20","v":0},{"$f":"Site!C20","v":0},{"$f":"Site!D20","v":0},{"$f":"Site!E20","v":0},{"$f":"Site!F20","v":0},{"$f":"IF(G$18>0,G17/G$18*100,0)","v":0}]
[null,null,null,null,null,null,{"$f":"Site!F21","v":0},{"$f":"SUM(H14:H17)","v":0}]
[]
[null,"Post-ReDevelopment Land Cover  (acres)"]
[null,null,"A soils","B Soils","C Soils","D Soils","Totals","% of Total"]
[null,"Forest (acres)",{"$f":"Site!B25","v":0},{"$f":"Site!C25","v":0},{"$f":"Site!D25","v":0},{"$f":"Site!E25","v":0},{"$f":"Site!F25","v":0},{"$f":"IF(G$18>0,G22/G$26*100,0)","v":0},{"$f":"IF(Site!F25>0,\"*\",\"\")","v":""}]
[null,"Mixed Open (acres)",{"$f":"Site!B26","v":0},{"$f":"Site!C26","v":0},{"$f":"Site!D26","v":0},{"$f":"Site!E26","v":0},{"$f":"Site!F26","v":0},{"$f":"IF(G$18>0,G23/G$26*100,0)","v":0}]
[null,"Managed Turf (acres)",{"$f":"Site!B27","v":0},{"$f":"Site!C27","v":0},{"$f":"Site!D27","v":0},{"$f":"Site!E27","v":0},{"$f":"Site!F27","v":0},{"$f":"IF(G$18>0,G24/G$26*100,0)","v":0}]
[null,"Impervious Cover (acres)",{"$f":"Site!B28","v":0},{"$f":"Site!C28","v":0},{"$f":"Site!D28","v":0},{"$f":"Site!E28","v":0},{"$f":"Site!F28","v":0},{"$f":"IF(G$18>0,G25/G$26*100,0)","v":0}]
[null,{"$f":"IF(Site!F24>0,\"* Forest/Open Space areas must be protected in accordance with the Virginia Runoff Reduction Method\",\"\")","v":"* Forest/Open Space areas must be protected in accordance with the Virginia Runoff Reduction Method"},null,null,null,null,{"$f":"Site!F29","v":0},{"$f":"SUM(H22:H25)","v":0}]
[null,"Site Tv and Land Cover Nutrient Loads"]
[null,null,"Final Post-Development \n(Post-ReDevelopment \n& New Impervious)",null,"Post-ReDevelopment","Post-Development (New Impervious)","Adjusted Pre-ReDevelopment",null,{"$f":"Site!A66","v":"Pre-ReDevelopment TP Load per acre\n(lb/acre/yr)"},{"$f":"Site!E66","v":"Final Post-Development TP Load per acre \n(lb/acre/yr)"},{"$f":"Site!H66","v":"Post-ReDevelopment TP Load per acre \n(lb/acre/yr)"}]
[null,"Site Rv",{"$f":"Site!F61","v":"--"},null,{"$f":"Site!I61","v":"--"},{"$f":"Site!L61","v":0},{"$f":"Site!C61","v":"--"},null,{"$f":"Site!C66","v":"--"},{"$f":"Site!F66","v":"--"},{"$f":"Site!I66","v":"--"}]
[null,"Treatment Volume (ft3) ",{"$f":"Site!F64","v":"--"},null,{"$f":"Site!I64","v":"--"},{"$f":"Site!L64","v":"--"},{"$f":"Site!C64","v":"--"}]
[null,"TP Load (lb/yr)",{"$f":"Site!F65","v":"--"},null,{"$f":"Site!I65","v":"--"},{"$f":"Site!L65","v":"--"},{"$f":"Site!C65","v":"--"}]
[null,null,null,{"$f":"IF(Site!D56=\"*\",\"Baseline TP Load (lb/yr):\",\"\")","v":""},{"$f":"IF(Site!D56=\"*\",Site!C58&\"*\",\"\")","v":""},{"$f":"IF(Site!D56=\"*\",\"*Reduction below new development load limitation not required\",\"\")","v":""}]
[null,"Total TP Load Reduction Required (lb/yr)",{"$f":"IF(Site!G33=\"--\",\"--\",IF(Site!$G$33=Site!$O$2,\"Check Areas!\",IF(Site!$E6=\"yes\",ROUND(Site!$G$34,2),Site!$G$33)))","v":"--"},null,{"$f":"IF(Site!$E6=\"yes\",\"N/A***\",IF(Site!I69=Site!$O$3,\"x\",Site!I69))","v":"--"},{"$f":"IF(Site!$E6=\"yes\",\"N/A***\",IF(Site!$L$69=Site!$O$3,\"x\",Site!$L$69))","v":"--"}]
[null,null,{"$f":"IF(Site!E6=\"yes\",\"***This is a linear development project\",\"\")","v":""}]
[null,null,"Final Post-Development Load \n(Post-ReDevelopment & New Impervious) ",null,null,null,"Pre-ReDevelopment"]
[null,"TN Load (lb/yr)",{"$f":"Site!J37","v":"--"},null,null,null,{"$f":"Site!D37","v":"--"}]
[]
[null,{"$f":"IF(C38=\"\",\"Site Compliance Summary\",\"Site Compliance Summary -\")","v":"Site Compliance Summary"},{"$f":"IF(Site!E6=\"yes\",\"***Linear Development Project\",\"\")","v":""}]
[]
[null,"Maximum % Reduction Required Below \nPre-ReDevelopment Load",null,{"$f":"IF(Site!I67=Site!$O$2,\"x\",Site!$I67)","v":"--"},{"$f":"IF(Site!D56=\"*\",\"  * Note: % Reduction will reduce post-development TP load to less than or equal to baseline load of \"&ROUND(Site!C58,2)&\" lb/yr (0.41 lb/ac/yr)\",\"\")","v":""}]
[null,null,null,null,{"$f":"IF(D32=\"\",\"\",IF(Site!E6=\"yes\",\"[Post-Dev Reduction Requirement = Post-Dev TP load - baseline load of \"&ROUND(Site!C58,2)&\" lb/yr], baseline load = site area x 0.41 lb/ac/yr\",IF(E40=\"\",\"\",\"    [Required reduction for Post-ReDev. = Post-ReDev TP load - baseline load of \"&Site!C58&\" lb/yr], baseline load = site area x 0.41 lb/ac/yr\")))","v":""}]
[]
[]
[null,"Total Runoff Volume Reduction (ft3)  ",{"$f":"'Water Quality Compliance'!G16","v":0},null,{"$f":"IF(AND(E45=E46,E46=E47,Site!P5=0),\"\",IF(Site!P5=\"incomplete\",\"Site tab incomplete\",\"Error Summary:\"))","v":""}]
[null,"Total TP Load Reduction Achieved (lb/yr)",{"$f":"IF(Site!E6=\"yes\",'Water Quality Compliance'!D26,'Water Quality Compliance'!B26)","v":"--"},null,{"$f":"IF(Site!P5=0,\"\",\"Errors on Site tab\")","v":""}]
[null,"Total TN Load Reduction Achieved (lb/yr)",{"$f":"'Water Quality Compliance'!B32","v":"--"},null,{"$f":"IF((COUNTIF(C58:G58,\"\"))=5,\"\",\" Errors on D.A. tab(s)\")","v":""}]
[null,"Remaining Post Development TP Load (lb/yr)",{"$f":"IFERROR(C31-C45,\"--\")","v":"--"},null,{"$f":"IF(OR(I53=\"X\", I55=\"X\",I56=\"X\"),\" Areas on D.A. tab(s) exceed Site tab areas\",\"\")","v":""}]
[null,"Remaining TP Load Reduction (lb/yr) Required",{"$f":"IFERROR(IF(AND(E45=E46,E46=E47),(IF(Site!E6=\"yes\",'Water Quality Compliance'!D28,'Water Quality Compliance'!B28)),\"Check Errors!\"),\"--\")","v":"--"},{"$f":"IF(C46=\"Check Errors!\",\"\",IF(Site!E6=\"no\",'Water Quality Compliance'!A29,'Water Quality Compliance'!E28))","v":""}]
[null,{"$f":"F32","v":""},null,{"$f":"IFERROR(IF(AND(C33-C45<0.005,C45<C33),\"      (Remaining TP load reduction <0.005)\",\"\"),\"\")","v":""}]
[null,"Drainage Area Summary"]
[]
[null,null,"D.A. A","D.A. B","D.A. C","D.A. D","D.A. E","Total"]
[null,"Forest (acres)",{"$f":"'D.A. A'!F5","v":0},{"$f":"'D.A. B'!F5","v":0},{"$f":"'D.A. C'!F5","v":0},{"$f":"'D.A. D'!F5","v":0},{"$f":"'D.A. E'!F5","v":0},{"$f":"SUM(C53:G53)","v":0},{"$f":"IF(Site!F24<('D.A. A'!F5+'D.A. B'!F5+'D.A. C'!F5+'D.A. D'!F5+'D.A. E'!F5),\"X\",\"\")","v":""}]
[null,"Mixed Open (acres)",{"$f":"'D.A. A'!F6","v":0},{"$f":"'D.A. B'!F6","v":0},{"$f":"'D.A. C'!F6","v":0},{"$f":"'D.A. D'!F6","v":0},{"$f":"'D.A. E'!F6","v":0},{"$f":"SUM(C54:G54)","v":0},{"$f":"IF('Water Quality Compliance'!G4=\"OK.\",\"\",\"X\")","v":""}]
[null,"Managed Turf (acres)",{"$f":"'D.A. A'!F7","v":0},{"$f":"'D.A. B'!F7","v":0},{"$f":"'D.A. C'!F7","v":0},{"$f":"'D.A. D'!F7","v":0},{"$f":"'D.A. E'!F7","v":0},0,{"$f":"IF('Water Quality Compliance'!G6=\"OK.\",\"\",\"X\")","v":""}]
[null,"Impervious Cover (acres)",{"$f":"'D.A. A'!F8","v":0},{"$f":"'D.A. B'!F8","v":0},{"$f":"'D.A. C'!F8","v":0},{"$f":"'D.A. D'!F8","v":0},{"$f":"'D.A. E'!F8","v":0},0,{"$f":"IF('Water Quality Compliance'!G8=\"OK.\",\"\",\"X\")","v":""}]
[null,"Total Area (acres)",{"$f":"SUM(C53:C56)","v":0},{"$f":"SUM(D53:D56)","v":0},{"$f":"SUM(E53:E56)","v":0},{"$f":"SUM(F53:F56)","v":0},{"$f":"SUM(G53:G56)","v":0},{"$f":" SUM(H53:H56)","v":0}]
[null,null,{"$f":"IF('Water Quality Compliance'!B10=\"OK.\",\"\",\"D.A. A Errors!\")","v":""},{"$f":"IF('Water Quality Compliance'!C10=\"OK.\",\"\",\"D.A. B Errors!\")","v":""},{"$f":"IF('Water Quality Compliance'!D10=\"OK.\",\"\",\"D.A. C Errors!\")","v":""},{"$f":"IF('Water Quality Compliance'!E10=\"OK.\",\"\",\"D.A. D Errors!\")","v":""},{"$f":"IF('Water Quality Compliance'!F10=\"OK.\",\"\",\"D.A. E Errors!\")","v":""}]
[null,"Drainage Area Compliance Summary"]
[]
[null,null,"D.A. A","D.A. B","D.A. C","D.A. D","D.A. E","Total"]
[null,"TP Load Reduced (lb/yr)",{"$f":"'D.A. A'!I116","v":0},{"$f":"'D.A. B'!I116","v":0},{"$f":"'D.A. C'!I116","v":0},{"$f":"'D.A. D'!I116","v":0},{"$f":"'D.A. E'!I116","v":0},{"$f":"SUM(C62:G62)","v":0}]
[null,"TN Load Reduced (lb/yr)",{"$f":"'D.A. A'!I123","v":0},{"$f":"'D.A. B'!I123","v":0},{"$f":"'D.A. C'!I123","v":0},{"$f":"'D.A. D'!I123","v":0},{"$f":"'D.A. E'!I123","v":0},{"$f":"SUM(C63:G63)","v":0}]
[]
[]
[null,"Drainage Area A Summary"]
[]
[null,"Land Cover Summary"]
[null,null,{"$f":"'D.A. A'!$B$3","v":0}]
[null,null,"A Soils","B Soils","C Soils","D Soils","Total","% of Total"]
[null,"Forest (acres)",{"$f":"'D.A. A'!B5","v":0},{"$f":"'D.A. A'!C5","v":0},{"$f":"'D.A. A'!D5","v":0},{"$f":"'D.A. A'!E5","v":0},{"$f":"'D.A. A'!F5","v":0},{"$f":"IF(G$75>0,G71/G$75*100,0)","v":0}]
[null,"Mixed Open (acres)",{"$f":"'D.A. A'!B6","v":0},{"$f":"'D.A. A'!C6","v":0},{"$f":"'D.A. A'!D6","v":0},{"$f":"'D.A. A'!E6","v":0},{"$f":"'D.A. A'!F6","v":0},{"$f":"IF(G$75>0,G72/G$75*100,0)","v":0}]
[null,"Managed Turf (acres)",{"$f":"'D.A. A'!B7","v":0},{"$f":"'D.A. A'!C7","v":0},{"$f":"'D.A. A'!D7","v":0},{"$f":"'D.A. A'!E7","v":0},{"$f":"'D.A. A'!F7","v":0},{"$f":"IF(G$75>0,G73/G$75*100,0)","v":0}]
[null,"Impervious Cover (acres)",{"$f":"'D.A. A'!B8","v":0},{"$f":"'D.A. A'!C8","v":0},{"$f":"'D.A. A'!D8","v":0},{"$f":"'D.A. A'!E8","v":0},{"$f":"'D.A. A'!F8","v":0},{"$f":"IF(G$75>0,G74/G$75*100,0)","v":0}]
[null,null,null,null,null,null,{"$f":"SUM(G71:G74)","v":0}]
[]
[null,"BMP Selections"]
[]
[null,"Practice","Open Mixed Area (acres)","Managed Turf Credit Area (acres)","Impervious Cover Credit Area (acres)","BMP Treatment Volume (ft3)","TP Load from Upstream Practices (lbs)","Untreated TP Load to Practice (lbs)","TP Removed (lb/yr)","TP Remaining (lb/yr)","Downstream Treatment to be Employed"]
[]
[null,"Total Impervious Cover Treated (acres)",{"$f":"'D.A. A'!$F$107","v":0}]
[null,"Total Turf Area Treated (acres) ",{"$f":"'D.A. A'!$F$109","v":0}]
[null,"Total Mixed Open Area Treated (acres) ",{"$f":"'D.A. A'!$F$108","v":0}]
[null,"Total TP Load Reduction Achieved in D.A. (lb/yr)",{"$f":"'D.A. A'!$I$116","v":0}]
[null,"Total TN Load Reduction Achieved in D.A. (lb/yr)",{"$f":"'D.A. A'!$I$123","v":0}]
[]
[]
[null,"Drainage Area B Summary"]
[]
[null,"Land Cover Summary"]
[null,null,{"$f":"'D.A. B'!$B$3","v":0}]
[null,null,"A Soils","B Soils","C Soils","D Soils","Total","% of Total"]
[null,"Forest (acres)",{"$f":"'D.A. B'!B5","v":0},{"$f":"'D.A. B'!C5","v":0},{"$f":"'D.A. B'!D5","v":0},{"$f":"'D.A. B'!E5","v":0},{"$f":"'D.A. B'!F5","v":0},{"$f":"IF(G$97>0,G93/G$97*100,0)","v":0}]
[null,"Mixed Open (acres)",{"$f":"'D.A. B'!B6","v":0},{"$f":"'D.A. B'!C6","v":0},{"$f":"'D.A. B'!D6","v":0},{"$f":"'D.A. B'!E6","v":0},{"$f":"'D.A. B'!F6","v":0},{"$f":"IF(G$97>0,G94/G$97*100,0)","v":0}]
[null,"Managed Turf (acres)",{"$f":"'D.A. B'!B7","v":0},{"$f":"'D.A. B'!C7","v":0},{"$f":"'D.A. B'!D7","v":0},{"$f":"'D.A. B'!E7","v":0},{"$f":"'D.A. B'!F7","v":0},0]
[null,"Impervious Cover (acres)",{"$f":"'D.A. B'!B8","v":0},{"$f":"'D.A. B'!C8","v":0},{"$f":"'D.A. B'!D8","v":0},{"$f":"'D.A. B'!E8","v":0},{"$f":"'D.A. B'!F8","v":0},0]
[null,null,null,null,null,null,{"$f":"SUM(G93:G96)","v":0}]
[]
[null,"BMP Selections"]
[]
[null,"Practice","Managed Turf Credit Area (acres)","Impervious Cover Credit Area (acres)","BMP Treatment Volume (ft3)","TP Load from Upstream Practices (lbs)","Untreated TP Load to Practice (lbs)","TP Removed (lb/yr)","TP Remaining (lb/yr)","Downstream Treatment to be Employed"]
[]
[null,"Total Impervious Cover Treated (acres)",{"$f":"'D.A. B'!$F$107","v":0}]
[null,"Total Turf Area Treated (acres) ",{"$f":"'D.A. B'!$F$109","v":0}]
[null,"Total Mixed Open Area Treated (acres) ",{"$f":"'D.A. B'!$F$108","v":0}]
[null,"Total TP Load Reduction Achieved in D.A. (lb/yr)",{"$f":"'D.A. B'!$I$116","v":0}]
[null,"Total TN Load Reduction Achieved in D.A. (lb/yr)",{"$f":"'D.A. B'!$I$123","v":0}]
[]
[]
[null,"Drainage Area C Summary"]
[]
[null,"Land Cover Summary"]
[null,null,{"$f":"'D.A. C'!$B$3","v":0}]
[null,null,"A Soils","B Soils","C Soils","D Soils","Total","% of Total"]
[null,"Forest (acres)",{"$f":"'D.A. C'!B5","v":0},{"$f":"'D.A. C'!C5","v":0},{"$f":"'D.A. C'!D5","v":0},{"$f":"'D.A. C'!E5","v":0},{"$f":"'D.A. C'!F5","v":0},{"$f":"IF(G$119>0,G115/G$119*100,0)","v":0}]
[null,"Mixed Open (acres)",{"$f":"'D.A. C'!B6","v":0},{"$f":"'D.A. C'!C6","v":0},{"$f":"'D.A. C'!D6","v":0},{"$f":"'D.A. C'!E6","v":0},{"$f":"'D.A. C'!F6","v":0},{"$f":"IF(G$119>0,G116/G$119*100,0)","v":0}]
[null,"Managed Turf (acres)",{"$f":"'D.A. C'!B7","v":0},{"$f":"'D.A. C'!C7","v":0},{"$f":"'D.A. C'!D7","v":0},{"$f":"'D.A. C'!E7","v":0},{"$f":"'D.A. C'!F7","v":0},{"$f":"IF(G$119>0,G117/G$119*100,0)","v":0}]
[null,"Impervious Cover (acres)",{"$f":"'D.A. C'!B8","v":0},{"$f":"'D.A. C'!C8","v":0},{"$f":"'D.A. C'!D8","v":0},{"$f":"'D.A. C'!E8","v":0},{"$f":"'D.A. C'!F8","v":0},{"$f":"IF(G$119>0,G118/G$119*100,0)","v":0}]
[null,null,null,null,null,null,{"$f":"SUM(G115:G118)","v":0}]
[]
[null,"BMP Selections"]
[]
[null,"Practice","Managed Turf Credit Area (acres)","Impervious Cover Credit Area (acres)","BMP Treatment Volume (ft3)","TP Load from Upstream Practices (lbs)","Untreated TP Load to Practice (lbs)","TP Removed (lb/yr)","TP Remaining (lb/yr)","Downstream Treatment to be Employed"]
[]
[null,"Total Impervious Cover Treated (acres)",{"$f":"'D.A. C'!$F$107","v":0}]
[null,"Total Turf Area Treated (acres) ",{"$f":"'D.A. C'!$F$109","v":0}]
[null,"Total Mixed Open Area Treated (acres) ",{"$f":"'D.A. C'!$F$108","v":0}]
[null,"Total TP Load Reduction Achieved in D.A. (lb/yr)",{"$f":"'D.A. C'!$I$116","v":0}]
[null,"Total TN Load Reduction Achieved in D.A. (lb/yr)",{"$f":"'D.A. C'!$I$123","v":0}]
[]
[]
[null,"Drainage Area D Summary"]
[]
[null,"Land Cover Summary"]
[null,null,{"$f":"'D.A. D'!$B$3","v":0}]
[null,null,"A Soils","B Soils","C Soils","D Soils","Total","% of Total"]
[null,"Forest (acres)",{"$f":"'D.A. D'!B5","v":0},{"$f":"'D.A. D'!C5","v":0},{"$f":"'D.A. D'!D5","v":0},{"$f":"'D.A. D'!E5","v":0},{"$f":"'D.A. D'!F5","v":0},{"$f":"IF(G$141>0,G137/G$141*100,0)","v":0}]
[null,"Mixed Open (acres)",{"$f":"'D.A. D'!B6","v":0},{"$f":"'D.A. D'!C6","v":0},{"$f":"'D.A. D'!D6","v":0},{"$f":"'D.A. D'!E6","v":0},{"$f":"'D.A. D'!F6","v":0},{"$f":"IF(G$141>0,G138/G$141*100,0)","v":0}]
[null,"Managed Turf (acres)",{"$f":"'D.A. D'!B7","v":0},{"$f":"'D.A. D'!C7","v":0},{"$f":"'D.A. D'!D7","v":0},{"$f":"'D.A. D'!E7","v":0},{"$f":"'D.A. D'!F7","v":0},{"$f":"IF(G$141>0,G139/G$141*100,0)","v":0}]
[null,"Impervious Cover (acres)",{"$f":"'D.A. D'!B8","v":0},{"$f":"'D.A. D'!C8","v":0},{"$f":"'D.A. D'!D8","v":0},{"$f":"'D.A. D'!E8","v":0},{"$f":"'D.A. D'!F8","v":0},{"$f":"IF(G$141>0,G140/G$141*100,0)","v":0}]
[null,null,null,null,null,null,{"$f":"SUM(G137:G140)","v":0}]
[]
[null,"BMP Selections"]
[]
[null,"Practice","Managed Turf Credit Area (acres)","Impervious Cover Credit Area (acres)","BMP Treatment Volume (ft3)","TP Load from Upstream Practices (lbs)","Untreated TP Load to Practice (lbs)","TP Removed (lb/yr)","TP Remaining (lb/yr)","Downstream Treatment to be Employed"]
[]
[null,"Total Impervious Cover Treated (acres)",{"$f":"'D.A. D'!$F$107","v":0}]
[null,"Total Turf Area Treated (acres) ",{"$f":"'D.A. D'!$F$109","v":0}]
[null,"Total Mixed Open Area Treated (acres) ",{"$f":"'D.A. D'!$F$108","v":0}]
[null,"Total TP Load Reduction Achieved in D.A. (lb/yr)",{"$f":"'D.A. D'!$I$116","v":0}]
[null,"Total TN Load Reduction Achieved in D.A. (lb/yr)",{"$f":"'D.A. D'!$I$123","v":0}]
[]
[]
[null,"Drainage Area E Summary"]
[]
[null,"Land Cover Summary"]
[null,null,{"$f":"'D.A. E'!$B$3","v":0}]
[null,null,"A Soils","B Soils","C Soils","D Soils","Total","% of Total"]
[null,"Forest (acres)",{"$f":"'D.A. E'!B5","v":0},{"$f":"'D.A. E'!C5","v":0},{"$f":"'D.A. E'!D5","v":0},{"$f":"'D.A. E'!E5","v":0},{"$f":"'D.A. E'!F5","v":0},{"$f":"IF(G$163>0,G159/G$163*100,0)","v":0}]
[null,"Mixed Open (acres)",{"$f":"'D.A. E'!B6","v":0},{"$f":"'D.A. E'!C6","v":0},{"$f":"'D.A. E'!D6","v":0},{"$f":"'D.A. E'!E6","v":0},{"$f":"'D.A. E'!F6","v":0},{"$f":"IF(G$163>0,G160/G$163*100,0)","v":0}]
[null,"Managed Turf (acres)",{"$f":"'D.A. E'!B7","v":0},{"$f":"'D.A. E'!C7","v":0},{"$f":"'D.A. E'!D7","v":0},{"$f":"'D.A. E'!E7","v":0},{"$f":"'D.A. E'!F7","v":0},{"$f":"IF(G$163>0,G161/G$163*100,0)","v":0}]
[null,"Impervious Cover (acres)",{"$f":"'D.A. E'!B8","v":0},{"$f":"'D.A. E'!C8","v":0},{"$f":"'D.A. E'!D8","v":0},{"$f":"'D.A. E'!E8","v":0},{"$f":"'D.A. E'!F8","v":0},{"$f":"IF(G$163>0,G162/G$163*100,0)","v":0}]
[null,null,null,null,null,null,{"$f":"SUM(G159:G162)","v":0}]
[]
[null,"BMP Selections"]
[]
[null,"Practice","Managed Turf Credit Area (acres)","Impervious Cover Credit Area (acres)","BMP Treatment Volume (ft3)","TP Load from Upstream Practices (lbs)","Untreated TP Load to Practice (lbs)","TP Removed (lb/yr)","TP Remaining (lb/yr)","Downstream Treatment to be Employed"]
[]
[null,"Total Impervious Cover Treated (acres)",{"$f":"'D.A. E'!$F$107","v":0}]
[null,"Total Turf Area Treated (acres) ",{"$f":"'D.A. E'!$F$109","v":0}]
[null,"Total Mixed Open Area Treated (acres) ",{"$f":"'D.A. E'!$F$108","v":0}]
[null,"Total TP Load Reduction Achieved in D.A. (lb/yr)",{"$f":"'D.A. E'!$I$116","v":0}]
[null,"Total TN Load Reduction Achieved in D.A. (lb/yr)",{"$f":"'D.A. E'!$I$123","v":0}]
[]
[]
[null,"Runoff Volume and CN Calculations"]
[]
[null,null,"1-year storm","2-year storm ","10-year storm "]
[null,"Target Rainfall Event (in)",{"$f":"'Runoff Volume and CN'!$E$6","v":0},{"$f":"'Runoff Volume and CN'!$F$6","v":0},{"$f":"'Runoff Volume and CN'!$G$6","v":0}]
[]
[null,"Drainage Areas","RV & CN","Drainage Area A","Drainage Area B","Drainage Area C","Drainage Area D","Drainage Area E"]
[null,"CN",null,{"$f":"'Runoff Volume and CN'!$H$33","v":0},{"$f":"'Runoff Volume and CN'!$H$49","v":0},{"$f":"'Runoff Volume and CN'!$H$65","v":0},{"$f":"'Runoff Volume and CN'!$H$81","v":0},{"$f":"'Runoff Volume and CN'!$H$97","v":0}]
[null,"RR (ft3)",null,{"$f":"'D.A. A'!$F$71","v":0},{"$f":"'D.A. B'!$F$71","v":0},{"$f":"'D.A. C'!$F$71","v":0},{"$f":"'D.A. D'!$F$71","v":0},{"$f":"'D.A. E'!$F$71","v":0}]
[null,"1-year return period","RV wo RR (ws-in)",{"$f":"'Runoff Volume and CN'!$E$35","v":0},{"$f":"'Runoff Volume and CN'!$E$51","v":0},{"$f":"'Runoff Volume and CN'!$E$67","v":0},{"$f":"'Runoff Volume and CN'!$E$83","v":0},{"$f":"'Runoff Volume and CN'!$E$99","v":0}]
[null,null,"RV w RR (ws-in)",{"$f":"'Runoff Volume and CN'!$E$36","v":0},{"$f":"'Runoff Volume and CN'!$E$52","v":0},{"$f":"'Runoff Volume and CN'!$E$68","v":0},{"$f":"'Runoff Volume and CN'!$E$84","v":0},{"$f":"'Runoff Volume and CN'!$E$100","v":0}]
[null,null,"CN adjusted",{"$f":"'Runoff Volume and CN'!$E$37","v":0},{"$f":"'Runoff Volume and CN'!$E$53","v":0},{"$f":"'Runoff Volume and CN'!$E$69","v":0},{"$f":"'Runoff Volume and CN'!$E$85","v":0},{"$f":"'Runoff Volume and CN'!$E$101","v":0}]
[null,"2-year return period","RV wo RR (ws-in)",{"$f":"'Runoff Volume and CN'!$F$35","v":0},{"$f":"'Runoff Volume and CN'!$F$51","v":0},{"$f":"'Runoff Volume and CN'!$F$67","v":0},{"$f":"'Runoff Volume and CN'!$F$83","v":0},{"$f":"'Runoff Volume and CN'!$F$99","v":0}]
[null,null,"RV w RR (ws-in)",{"$f":"'Runoff Volume and CN'!$F$36","v":0},{"$f":"'Runoff Volume and CN'!$F$52","v":0},{"$f":"'Runoff Volume and CN'!$F$68","v":0},{"$f":"'Runoff Volume and CN'!$F$84","v":0},{"$f":"'Runoff Volume and CN'!$F$100","v":0}]
[null,null,"CN adjusted",{"$f":"'Runoff Volume and CN'!$F$37","v":0},{"$f":"'Runoff Volume and CN'!$F$53","v":0},{"$f":"'Runoff Volume and CN'!$F$69","v":0},{"$f":"'Runoff Volume and CN'!$F$85","v":0},{"$f":"'Runoff Volume and CN'!$F$101","v":0}]
[null,"10-year return period","RV wo RR (ws-in)",{"$f":"'Runoff Volume and CN'!$G$35","v":0},{"$f":"'Runoff Volume and CN'!$G$51","v":0},{"$f":"'Runoff Volume and CN'!$G$67","v":0},{"$f":"'Runoff Volume and CN'!$G$83","v":0},{"$f":"'Runoff Volume and CN'!$G$99","v":0}]
[null,null,"RV w RR (ws-in)",{"$f":"'Runoff Volume and CN'!$G$36","v":0},{"$f":"'Runoff Volume and CN'!$G$52","v":0},{"$f":"'Runoff Volume and CN'!$G$68","v":0},{"$f":"'Runoff Volume and CN'!$G$84","v":0},{"$f":"'Runoff Volume and CN'!$G$100","v":0}]
[null,null,"CN adjusted",{"$f":"'Runoff Volume and CN'!$G$37","v":0},{"$f":"'Runoff Volume and CN'!$G$53","v":0},{"$f":"'Runoff Volume and CN'!$G$69","v":0},{"$f":"'Runoff Volume and CN'!$G$85","v":0},{"$f":"'Runoff Volume and CN'!$G$101","v":0}]

{"sheet":"VHid","index":1,"n_rows":1,"n_cols":1,"rows_kept":1,"cut":false,"hidden":true,"merged":[]}
["VRRMsafe2023"]

{"sheet":"Site","index":2,"n_rows":70,"n_cols":27,"rows_kept":70,"cut":false,"hidden":false,"merged":[[3,1,3,4],[4,1,4,4],[7,1,7,5],[9,2,9,4],[9,7,9,8],[10,6,10,8],[11,3,11,4],[12,6,12,8],[12,10,12,12],[13,10,13,12],[66,0,66,1],[68,0,69,2],[68,4,68,5],[69,7,69,8],[13,6,13,8],[36,1,36,2],[36,7,36,8],[39,0,39,2],[39,4,39,11],[14,7,14,9],[32,3,32,5],[33,3,33,5],[35,1,35,9],[31,2,31,7],[41,7,41,8],[41,4,41,5],[41,0,41,2],[41,10,41,11],[42,10,42,11],[61,4,61,11],[61,0,61,2],[42,4,42,5],[42,7,42,8]]}
[null,null,null,null,"DEQ Virginia Runoff Reduction Method Re-Development Compliance Spreadsheet  - Version 4.1 ",null,null,null,null,null,null,null,null,null,null,"#errors"]
[null,null,null,null,null,null,null,null,null,null,null,null,null,null,"Check Areas!",{"$f":"IF(OR(F21=0,F29=0),\"\",COUNTIF(B29:E29,\"Check Areas!\"))","v":""},null,null,"Yes"]
[null,null,null,null,null,null,null,null,null,null,null,null,null,null,"ENTER TOTAL DISTURBED AREA ABOVE!",{"$f":"IF(F10>0,0,IF(OR(F21=0,F29=0),\"\",1))","v":""},null,null,"No"]
["Project Name: ",null,null,null,null,null,null,null,null,null,null,null,null,null,"ENTER LAND COVER AREAS!"]
["Date: ",null,null,null,null,null,null,null,null,null,null,null,null,null,"Total errors",{"$f":"IF(AND(P2=\"\",P3=\"\"),0,IF(OR(P2=\"\",P3=\"\"),\"incomplete\",IF(P2+P3=0,0,P2+P3)))","v":0}]
[null,null,null,"Linear Development Project?","No"]
["Site Information"]
[null,{"$f":"IF(AND($F$10=0,$F$21=0,$F$29=0),\"ENTER AREAS IN DATA INPUT CELLS FOR RESULTS\",\"\")","v":"ENTER AREAS IN DATA INPUT CELLS FOR RESULTS"}]
["Post-Development Project (Treatment Volume and Loads)",null,null,null,null,null,null,null,null,null,null,null,null,null,"Total Site Area =",{"$f":"S13+S21","v":0}]
[null,null,"Enter Total Disturbed Area (acres)  →",null,null,null,{"$f":"IF(P3=1,\"←\",\"\")","v":""},"Check:",null,true]
[null,null,null,null,null,null,"BMP Design Specifications List:",null,null,"2024 Stds & Specs"]
[null,null,null," Maximum reduction required:",null,{"$f":"IF(F10=0,\"--\",$I$67)","v":"--"},null,null,"Linear project?",{"$f":"IF(E6=\"yes\",\"Yes\",\"No\")","v":"No"},null,null,null,null,"A soils","B Soils","C Soils","D Soils","Total"]
[null,null,null,null,"The site's net increase in impervious cover (acres) is:",{"$f":"IF(OR(F12=\"--\",P5=\"incomplete\"),\"--\",IF(P2>0,\"x\",$L$56))","v":"--"},"Land cover areas entered correctly?",null,null,{"$f":"IF(P2=\"\",\"___\",IF(P2=0,\"✔\",IF(P2>0,\"x\",\"___\")))","v":"___"},{"$f":"IF(AND(P2>0,F21>0,F29>0),\"Pre- & Post Area Inputs must be equal!\",\"\")","v":""},null,null,"Increase in Imperv.:",{"$f":"B28-B20","v":0},{"$f":"C28-C20","v":0},0,{"$f":"E28-E20","v":0},{"$f":"SUM(O13:R13)","v":0}]
[null,null,null,null,"Post-Development TP Load Reduction for Site (lb/yr):",{"$f":"+IF(OR($F$12=\"--\",$P$5=\"incomplete\"),\"--\",IF($E$69=$O$3,\"x\",(IF($P$2>0,\"x\",IF($E$6=\"yes\",G34,G33)))))","v":"--"},"Total disturbed area entered?",null,null,{"$f":"IF(P3=1,\"x\",IF(P3=0,\"✔\",IF(P3=\"\",\"___\",\"\")))","v":"___"},{"$f":"IF(P3=1,\"Total disturbed area missing!\",IF(AND(F10>F29,P3=0),\"Total disturbed area > Post-Development area!\",\"\"))","v":""}]
["Pre-ReDevelopment Land Cover  (acres)",null,null,null,null,null,null,{"$f":"IF(G33<=0,\"TP LOAD REDUCTION NOT REQUIRED\",\"\")","v":""},null,null,null,null,null,null,"Pre-ReDevelopment-ADJUSTED"]
[null,"A Soils","B Soils","C Soils","D Soils","Totals",null,null,null,null,null,null,null,null,"A soils","B Soils","C Soils","D Soils","Total",null,null,null,"A soils","B Soils","C Soils","D Soils"]
["Forest (acres) -- undisturbed, protected forest or reforested land",null,null,null,null,{"$f":"SUM(B17:E17)","v":0},null,null,null,null,null,null,null,"F",{"$f":"_xlfn.SWITCH(W$20,0,B25,1,B17,10,IFERROR((B17-(B$28-B$20)*(B17-B25)/(B17-B25+B19-B27)),0),11,B17,100,IFERROR((B17-(B$28-B$20)*(B17-B25)/(B17-B25+B18-B26)),0),101,B17,110,B17-(B$28-B$20),111,B25)","v":0},{"$f":"_xlfn.SWITCH(X$20,0,C25,1,C17,10,IFERROR((C17-(C$28-C$20)*(C17-C25)/(C17-C25+C19-C27)),0),11,C17,100,IFERROR((C17-(C$28-C$20)*(C17-C25)/(C17-C25+C18-C26)),0),101,C17,110,C17-(C$28-C$20),111,C25)","v":0},{"$f":"_xlfn.SWITCH(Y$20,0,D25,1,D17,10,IFERROR((D17-(D$28-D$20)*(D17-D25)/(D17-D25+D19-D27)),0),11,D17,100,IFERROR((D17-(D$28-D$20)*(D17-D25)/(D17-D25+D18-D26)),0),101,D17,110,D17-(D$28-D$20),111,D25)","v":0},{"$f":"_xlfn.SWITCH(Z$20,0,E25,1,E17,10,IFERROR((E17-(E$28-E$20)*(E17-E25)/(E17-E25+E19-E27)),0),11,E17,100,IFERROR((E17-(E$28-E$20)*(E17-E25)/(E17-E25+E18-E26)),0),101,E17,110,E17-(E$28-E$20),111,E25)","v":0},{"$f":"SUM(O17:R17)","v":0},null,null,"F Increase",{"$f":"IF(B25>=B17,1,0)","v":1},{"$f":"IF(C25>=C17,1,0)","v":1},{"$f":"IF(D25>=D17,1,0)","v":1},{"$f":"IF(E25>=E17,1,0)","v":1},1]
["Mixed Open (acres) -- undisturbed/infrequently maintained grass or shrub land",null,null,null,null,{"$f":"SUM(B18:E18)","v":0},null,null,null,null,null,null,null,"MO",{"$f":"_xlfn.SWITCH(W$20,0,B26,1,IFERROR((B18-(B$28-B$20)*(B18-B26)/(B18-B26+B19-B27)),0),10,B18,11,B18,100,IFERROR((B18-(B$28-B$20)*(B18-B26)/(B18-B26+B17-B25)),0),101,B18-(B$28-B$20),110,B18,111,B26)","v":0},{"$f":"_xlfn.SWITCH(X$20,0,C26,1,IFERROR((C18-(C$28-C$20)*(C18-C26)/(C18-C26+C19-C27)),0),10,C18,11,C18,100,IFERROR((C18-(C$28-C$20)*(C18-C26)/(C18-C26+C17-C25)),0),101,C18-(C$28-C$20),110,C18,111,C26)","v":0},{"$f":"_xlfn.SWITCH(Y$20,0,D26,1,IFERROR((D18-(D$28-D$20)*(D18-D26)/(D18-D26+D19-D27)),0),10,D18,11,D18,100,IFERROR((D18-(D$28-D$20)*(D18-D26)/(D18-D26+D17-D25)),0),101,D18-(D$28-D$20),110,D18,111,D26)","v":0},{"$f":"_xlfn.SWITCH(Z$20,0,E26,1,IFERROR((E18-(E$28-E$20)*(E18-E26)/(E18-E26+E19-E27)),0),10,E18,11,E18,100,IFERROR((E18-(E$28-E$20)*(E18-E26)/(E18-E26+E17-E25)),0),101,E18-(E$28-E$20),110,E18,111,E26)","v":0},{"$f":"SUM(O18:R18)","v":0},null,null,"MO Increase",{"$f":"IF(B26>=B18,10,0)","v":10},{"$f":"IF(C26>=C18,10,0)","v":10},{"$f":"IF(D26>=D18,10,0)","v":10},{"$f":"IF(E26>=E18,10,0)","v":10},10]
["Managed Turf (acres) -- disturbed, graded for yards or other turf to be mowed/managed",null,null,null,null,{"$f":"SUM(B19:E19)","v":0},null,null,null,null,null,null,null,"MT",{"$f":"_xlfn.SWITCH(W$20,0,B27,1,IFERROR((B19-(B$28-B$20)*(B19-B27)/(B18-B26+B19-B27)),0),10,IFERROR((B19-(B$28-B$20)*(B19-B27)/(B17-B25+B19-B27)),0),11,B19-(B$28-B$20),100,B19,101,B19,110,B19,111,B27)","v":0},{"$f":"_xlfn.SWITCH(X$20,0,C27,1,IFERROR((C19-(C$28-C$20)*(C19-C27)/(C18-C26+C19-C27)),0),10,IFERROR((C19-(C$28-C$20)*(C19-C27)/(C17-C25+C19-C27)),0),11,C19-(C$28-C$20),100,C19,101,C19,110,C19,111,C27)","v":0},{"$f":"_xlfn.SWITCH(Y$20,0,D27,1,IFERROR((D19-(D$28-D$20)*(D19-D27)/(D18-D26+D19-D27)),0),10,IFERROR((D19-(D$28-D$20)*(D19-D27)/(D17-D25+D19-D27)),0),11,D19-(D$28-D$20),100,D19,101,D19,110,D19,111,D27)","v":0},{"$f":"_xlfn.SWITCH(Z$20,0,E27,1,IFERROR((E19-(E$28-E$20)*(E19-E27)/(E18-E26+E19-E27)),0),10,IFERROR((E19-(E$28-E$20)*(E19-E27)/(E17-E25+E19-E27)),0),11,E19-(E$28-E$20),100,E19,101,E19,110,E19,111,E27)","v":0},{"$f":"SUM(O19:R19)","v":0},null,null,"MT Increase",{"$f":"IF(B27>=B19,100,0)","v":100},{"$f":"IF(C27>=C19,100,0)","v":100},{"$f":"IF(D27>=D19,100,0)","v":100},{"$f":"IF(E27>=E19,100,0)","v":100},100]
["Impervious Cover (acres)",null,null,null,null,{"$f":"SUM(B20:E20)","v":0},null,null,null,null,null,null,null,"IC",{"$f":"B20","v":0},{"$f":"C20","v":0},0,0,{"$f":"SUM(O20:R20)","v":0},null,null,"Sum",{"$f":"SUM(W17:W19)","v":111},{"$f":"SUM(X17:X19)","v":111},{"$f":"SUM(Y17:Y19)","v":111},{"$f":"SUM(Z17:Z19)","v":111}]
[null,null,null,null,null,{"$f":"SUM(F17:F20)","v":0},null,null,null,null,null,null,null,null,null,null,null,"Total",{"$f":"SUM(S17:S20)","v":0}]
[]
["Post-Development Land Cover  (acres)"]
[null,"A Soils","B Soils","C Soils","D Soils","Totals"]
["Forest/Open Space (acres) -- undisturbed, protected forest or reforested land",null,null,null,null,{"$f":"SUM(B25:E25)","v":0},{"$f":"IF(F25>0,\"*\",\"\")","v":""}]
["Mixed Open (acres) -- undisturbed/infrequently maintained grass or shrub land",null,null,null,null,{"$f":"SUM(B26:E26)","v":0},{"$f":"IF(F26>0,\"*\",\"\")","v":""}]
["Managed Turf (acres) -- disturbed, graded for yards or other turf to be mowed/managed",null,null,null,null,{"$f":"SUM(B27:E27)","v":0}]
["Impervious Cover (acres)",null,null,null,null,{"$f":"SUM(B28:E28)","v":0}]
["Area Check",{"$f":"IF((ABS(ROUND(SUM(B17:B20),4)-ROUND(SUM(B25:B28),4))>0),$O$2,\"OK.\")","v":"OK."},{"$f":"IF((ABS(ROUND(SUM(C17:C20),4)-ROUND(SUM(C25:C28),4))>0),$O$2,\"OK.\")","v":"OK."},{"$f":"IF((ABS(ROUND(SUM(D17:D20),4)-ROUND(SUM(D25:D28),4))>0),$O$2,\"OK.\")","v":"OK."},{"$f":"IF((ABS(ROUND(SUM(E17:E20),4)-ROUND(SUM(E25:E28),4))>0),$O$2,\"OK.\")","v":"OK."},{"$f":"SUM(F25:F28)","v":0}]
[{"$f":"IF(OR(F25>0, F26>0),\"* Forest & Mixed Open areas must be protected in accordance with the Virginia Runoff Reduction Method or other applicable DEQ guidelines\",\"\")","v":""}]
[]
[null,null,"Post-Development Requirement for Site Area"]
[null,null,null,"TP Load Reduction Required (lb/yr)",null,null,{"$f":"+IF(F13=\"--\",\"--\",IF($E$69=$O$3,$O$3,(IF(P2>0,$O$2,($L$69+$I$69)))))","v":"--"},{"$f":"IF(G33<0.0049,\"**\",\"\")","v":""},{"$f":"IF(H33=\"**\",\"TP LOAD REDUCTION NOT REQUIRED\",\"\")","v":""}]
[null,null,null,"Linear Project TP Load Reduction Required (lb/yr): ",null,null,{"$f":"+IF(E6=\"yes\",IF(F13=\"--\",\"--\",IF(E69=$O$3,$O$3,IF(P2>0,$O$2,IF((0.8)*B65<(B60*Constants!B3),F65-B60*Constants!B3,F65-(0.8)*B65)))),\"N/A\")","v":"N/A"},{"$f":"IF(G34<0.0049,\"**\",\"\")","v":""},{"$f":"IF(H34=\"**\",\"TP LOAD REDUCTION NOT REQUIRED\",\"\")","v":""}]
[]
[null,"Nitrogen Loads (Informational Purposes Only)"]
[null,"Pre-ReDevelopment TN Load (lb/yr)",null,{"$f":"IF(F13=\"--\",\"--\",IF(P2>0,$O$2,SUMPRODUCT(B17:E20,Constants!B21:E24)))","v":"--"},null,null,null,"Final Post-Development TN Load",null,{"$f":"IF(F13=\"--\",\"--\",IF(P2>0,$O$2,SUMPRODUCT(B25:E28,Constants!B21:E24)))","v":"--"}]
[]
[]
["LAND COVER SUMMARY --  PRE-REDEVELOPMENT",null,null,null,"LAND COVER SUMMARY -- POST DEVELOPMENT"]
[]
["Land Cover Summary-Pre",null,null,null,"Land Cover Summary-Post (Final)",null,null,"Land Cover Summary-Post",null,null,"Land Cover Summary-Post"]
["Pre-ReDevelopment","Listed","Adjusted1",null,"Post ReDev. & New Impervious",null,null,"Post-ReDevelopment",null,null,"Post-Development New Impervious"]
["Forest Cover (acres)",{"$f":"IF(F13=\"--\",\"--\",IF(P2>0,\"x\",F17))","v":"--"},{"$f":"IF(F13=\"--\",\"--\",IF(P2>0,\"x\",IF(F20>=F28,B44,IFERROR($S$17,0))))","v":"--"},null,"Forest Cover (acres)",{"$f":"IF(F13=\"--\",\"--\",IF(P2>0,\"x\",$I$44))","v":"--"},null,"Forest Cover (acres)",{"$f":"IF(F13=\"--\",\"--\",IF(P2>0,\"x\",$F$25))","v":"--"}]
["Weighted Rv(forest)",{"$f":"IF(OR(B$44=\"--\",B$44=\"x\"),B$44,IFERROR(SUMPRODUCT(B17:E17,Constants!B7:E7)/B44,0))","v":"--"},{"$f":"IF(OR(C44=\"--\",C44=\"x\"),C44,IF(F28-F20<=0,B45,IFERROR(SUMPRODUCT(O17:R17,Constants!B7:E7)/C44,0)))","v":"--"},null,"Weighted Rv(forest)",{"$f":"IF(OR(F44=\"--\",F44=\"x\"),F44,$I$45)","v":"--"},null,"Weighted Rv(forest)",{"$f":"IF(OR(I44=\"--\",I44=\"x\"),I44,IFERROR(SUMPRODUCT($B$25:$E$25,Constants!$B$7:$E$7)/$I$44,0))","v":"--"}]
["Weighted Loading Rate(forest)",{"$f":"IF(OR(B44=\"--\",B44=\"x\"),B44,IFERROR(SUMPRODUCT($B17:$E17,Constants!$B14:$E14)/B44,0))","v":"--"},{"$f":"IF(OR(C44=\"--\",C44=\"x\"),C44,IFERROR(C44/B44*SUMPRODUCT($B17:$E17,Constants!$B14:$E14)/C44,0))","v":"--"},null,"Wgt. Ld. Rate(forest)",{"$f":"IF(OR(F44=\"--\",F44=\"x\"),F44,$I$46)","v":"--"},null,"Wgt. Ld. Rate(forest)",{"$f":"IF(OR(I44=\"--\",I44=\"x\"),I44,IFERROR(SUMPRODUCT($B$25:$E$25,Constants!$B$14:$E$14)/I44,0))","v":"--"}]
["% Forest",{"$f":"IF(OR(B44=\"--\",B44=\"x\"),B44,IFERROR(SUM(B44)/B$60,0))","v":"--"},{"$f":"IF(OR(C44=\"--\",C44=\"x\"),C44,IFERROR(C44/C$60,0))","v":"--"},null,"% Forest",{"$f":"IF(OR(F44=\"--\",F44=\"x\"),F44,IFERROR($F$44/$F$60,\"--\"))","v":"--"},null,"% Forest",{"$f":"IF(OR(I44=\"--\",I44=\"x\"),I44,IFERROR($I$44/$I$60,0))","v":"--"}]
["Mixed Open Cover (acres)",{"$f":"IF(F13=\"--\",\"--\",IF(P2>0,\"x\",F18))","v":"--"},{"$f":"IF(OR(C44=\"--\",C44=\"x\"),C44,IF(F20>=F28,B48,IFERROR(S18,0)))","v":"--"},null,"Mixed Open Cover (acres)",{"$f":"IF(OR(F44=\"--\",F44=\"x\"),F44,$I$48)","v":"--"},null,"Mixed Open Cover (acres)",{"$f":"IF(OR(I44=\"--\",I44=\"x\"),I44,$F$26)","v":"--"}]
["Weighted Rv(mixed)",{"$f":"IF(OR(B48=\"--\",B48=\"x\"),B48,IFERROR(SUMPRODUCT(B18:E18,Constants!B8:E8)/B48,0))","v":"--"},{"$f":"IF(OR(C44=\"--\",C44=\"x\"),C44,IFERROR(IF(F28-F20<=0,B49,IFERROR(SUMPRODUCT(O18:R18,Constants!B8:E8)/C48,0)),0))","v":"--"},null,"Weighted Rv(mixed)",{"$f":"IF(OR(F44=\"--\",F44=\"x\"),F44,$I$49)","v":"--"},null,"Weighted Rv(mixed)",{"$f":"IF(OR(I44=\"--\",I44=\"x\"),I44,IFERROR(SUMPRODUCT($B$26:$E$26,Constants!$B$8:$E$8)/$I$48,0))","v":"--"}]
["Weighted Loading Rate(mixed)",{"$f":"IF(OR(B48=\"--\",B48=\"x\"),B48,IFERROR(SUMPRODUCT($B18:$E18,Constants!$B15:$E15)/B48,0))","v":"--"},{"$f":"IF(OR(C48=\"--\",C48=\"x\"),C48,IFERROR(C48/B48*SUMPRODUCT($B18:$E18,Constants!$B15:$E15)/C48,0))","v":"--"},null,"Wgt. Ld. Rate(mixed)",{"$f":"IF(OR(F48=\"--\",F48=\"x\"),F48,$I$50)","v":"--"},null,"Wgt. Ld. Rate(mixed)",{"$f":"IF(OR(I48=\"--\",I48=\"x\"),I48,IFERROR(SUMPRODUCT($B$26:$E$26,Constants!$B$15:$E$15)/I48,0))","v":"--"}]
["% Mixed Open",{"$f":"IF(OR(B48=\"--\",B48=\"x\"),B48,IFERROR(SUM(B48)/B$60,0))","v":"--"},{"$f":"IF(OR(C44=\"--\",C44=\"x\"),C44,IFERROR(C48/C$60,0))","v":"--"},null,"% Mixed Open",{"$f":"IF(OR(F44=\"--\",F44=\"x\"),F44,IFERROR($F$48/$F$60,\"--\"))","v":"--"},null,"% Mixed Open",{"$f":"IF(OR(I44=\"--\",I44=\"x\"),I44,IFERROR($I$48/$I$60,0))","v":"--"}]
["Managed Turf Cover (acres)",{"$f":"IF(OR(B44=\"--\",B44=\"x\"),B44,F19)","v":"--"},{"$f":"IF(OR(C44=\"--\",C44=\"x\"),C44,IF(F20>=F28,B52,IFERROR(S19,0)))","v":"--"},null,"Managed Turf Cover (acres)",{"$f":"IF(OR(F44=\"--\",F44=\"x\"),F44,$I$52)","v":"--"},null,"Managed Turf Cover (acres)",{"$f":"IF(OR(I44=\"--\",I44=\"x\"),I44,$F$27)","v":"--"}]
["Weighted Rv(turf)",{"$f":"IF(OR(B44=\"--\",B44=\"x\"),B44,IFERROR(SUMPRODUCT(B19:E19,Constants!B9:E9)/B52,0))","v":"--"},{"$f":"IF(OR(C44=\"--\",C44=\"x\"),C44,IFERROR(IF(F28-F20<=0,B53,IFERROR(SUMPRODUCT(O19:R19,Constants!B9:E9)/C52,0)),0))","v":"--"},null,"Weighted Rv (turf)",{"$f":"IF(OR(F44=\"--\",F44=\"x\"),F44,$I$53)","v":"--"},null,"Weighted Rv (turf)",{"$f":"IF(OR(I44=\"--\",I44=\"x\"),I44,IFERROR(SUMPRODUCT($B$27:$E$27,Constants!$B$9:$E$9)/$I$52,0))","v":"--"}]
["Weighted Loading Rate(turf)",{"$f":"IF(OR(B52=\"--\",B52=\"x\"),B52,IFERROR(SUMPRODUCT($B19:$E19,Constants!$B16:$E16)/B52,0))","v":"--"},{"$f":"IF(OR(C52=\"--\",C52=\"x\"),C52,IFERROR(C52/B52*SUMPRODUCT($B19:$E19,Constants!$B16:$E16)/C52,0))","v":"--"},null,"Wgt. Ld. Rate(turf)",{"$f":"IF(OR(F52=\"--\",F52=\"x\"),F52,$I$54)","v":"--"},null,"Wgt. Ld. Rate(turf)",{"$f":"IF(OR(I52=\"--\",I52=\"x\"),I52,IFERROR(SUMPRODUCT($B$27:$E$27,Constants!$B$16:$E$16)/I52,0))","v":"--"}]
["% Managed Turf",{"$f":"IF(OR(B44=\"--\",B44=\"x\"),B44,IFERROR(B52/B$60,0))","v":"--"},{"$f":"IF(OR(C44=\"--\",C44=\"x\"),C44,IFERROR(C52/C$60,0))","v":"--"},null,"% Managed Turf",{"$f":"IF(OR(F44=\"--\",F44=\"x\"),F44,IFERROR($F$52/$F$60,\"--\"))","v":"--"},null,"% Managed Turf",{"$f":"IF(OR(I44=\"--\",I44=\"x\"),I44,IFERROR($I$52/$I$60,0))","v":"--"}]
["Impervious Cover (acres)",{"$f":"IF(OR(B44=\"--\",B44=\"x\"),B44,F20)","v":"--"},{"$f":"B56","v":"--"},null,"Impervious Cover (acres)",{"$f":"IF(OR(F44=\"--\",F44=\"x\"),F44,$I$56+$L$56)","v":"--"},null,"ReDev. Impervious Cover (acres)",{"$f":"IF(OR(I44=\"--\",I44=\"x\"),I44,$F$28-$L$56)","v":"--"},null,"New Impervious Cover (acres)",{"$f":"IF(P2=1,\"--\",IF(P5>0,\"x\",IF($F$28-$F$20<0,0,$F$28-$F$20)))","v":0}]
["Rv(impervious)",{"$f":"IF(OR(F13=\"--\",P2>0),\"--\",Constants!B10)","v":"--"},{"$f":"B57","v":"--"},null,"Rv(impervious)",{"$f":"IF(OR(F13=\"--\",P2>0),\"--\",$I$57)","v":"--"},null,"Rv(impervious)",{"$f":"IF(OR(F13=\"--\",P2>0),\"--\",Constants!$B$10)","v":"--"},null,"Rv(impervious)",{"$f":"IF(OR(L56=\"--\",L56=\"x\"),L56,IF($F$28-$F$20<=0,\"--\",Constants!B10))","v":"--"}]
["Weighted Loading Rate(impervious)",{"$f":"IF(OR(B56=\"--\",B56=\"x\"),B56,IFERROR(SUMPRODUCT($B20:$E20,Constants!$B17:$E17)/B56,0))","v":"--"},{"$f":"IF(OR(C56=\"--\",C56=\"x\"),C56,IFERROR(SUMPRODUCT($B20:$E20,Constants!$B17:$E17)/C56,0))","v":"--"},null,"Wgt. Ld. Rate(imperv.)",{"$f":"IF(OR(F56=\"--\",F56=\"x\"),F56,IFERROR(SUMPRODUCT($B$28:$E$28,Constants!$B$17:$E$17)/F56,0))","v":"--"},null,"Wgt. Ld. Rate(imperv.)",{"$f":"IF(OR(I56=\"--\",I56=\"x\"),I56,IFERROR(I56/F56*SUMPRODUCT($B$28:$E$28,Constants!$B$17:$E$17)/I56,0))","v":"--"}]
["% Impervious",{"$f":"IF(OR(B44=\"--\",B44=\"x\"),B44,IFERROR(B56/B60,0))","v":"--"},{"$f":"IF(OR(C44=\"--\",C44=\"x\"),C44,IFERROR(C56/C60,0))","v":"--"},null,"% Impervious",{"$f":"IF(OR(F44=\"--\",F44=\"x\"),F44,($F$56/$F$60))","v":"--"},null,"% Impervious",{"$f":"IF(OR(I44=\"--\",I44=\"x\"),I44,IFERROR($I$56/$I$60,0))","v":"--"}]
["Total Site Area (acres)",{"$f":"IF(OR(B44=\"--\",B44=\"x\"),B44,(B56+B52+B48+B44))","v":"--"},{"$f":"IF(OR(C44=\"--\",C44=\"x\"),C44,(C56+C52+C44+C48))","v":"--"},null,"Final Site Area (acres)",{"$f":"IF(OR(F44=\"--\",F44=\"x\"),F44,$I$60+$L$56)","v":"--"},null,"Total ReDev. Site Area (acres)",{"$f":"IF(OR(I44=\"--\",I44=\"x\"),I44,($I$56+$I$52+$I$48+$I$44))","v":"--"}]
["Site Rv",{"$f":"IF(OR(B44=\"--\",B44=\"x\"),B44,(B45*B47+B49*B51+B53*B55+B57*B59))","v":"--"},{"$f":"IF(OR(C44=\"--\",C44=\"x\"),C44,(C45*C47+C53*C55+C57*C59+C49*C51))","v":"--"},null,"Final Post Dev Site Rv",{"$f":"IF(OR(F44=\"--\",F44=\"x\"),F44,($F$45*$F$47+$F$53*$F$55+$F$57*$F$59+F51*F49))","v":"--"},null,"ReDev Site Rv",{"$f":"IF(OR(I44=\"--\",I44=\"x\"),I44,($I$45*$I$47+$I$53*$I$55+$I$57*$I$59+I51*I49))","v":"--"}]
["Treatment Volume and Nutrient Load",null,null,null,"Treatment Volume and Nutrient  Load"]
["Pre-ReDevelopment Treatment Volume \n(acre-ft) ",{"$f":"IF(OR(B44=\"--\",B44=\"x\"),B44,(Constants!B2*B61*B60/12))","v":"--"},{"$f":"IF(OR(C44=\"--\",C44=\"x\"),C44,(Constants!B2*C61*C60/12))","v":"--"},null,"Final Post-Development Treatment Volume               (acre-ft) ",{"$f":"IF(OR(F44=\"--\",F44=\"x\"),F44,(Constants!$B$2*$F$61*$F$60/12))","v":"--"},null,"Post-ReDevelopment Treatment Volume               (acre-ft) ",{"$f":"IF(OR(I44=\"--\",I44=\"x\"),I44,(Constants!$B$2*$I$61*$I$60/12))","v":"--"},null,"Post-Development Treatment Volume \n(acre-ft) ",{"$f":"IF(OR(L56=\"--\",L56=\"x\",L56=0),\"--\",(Constants!$B$2*$L$57*($L$56))/12)","v":"--"}]
["Pre-ReDevelopment Treatment Volume \n(cubic feet) ",{"$f":"IF(OR(B44=\"--\",B44=\"x\"),B44,(B63*43560))","v":"--"},{"$f":"IF(OR(C44=\"--\",C44=\"x\"),C44,(C63*43560))","v":"--"},null,"Final Post-Development Treatment Volume (cubic feet) ",{"$f":"IF(OR(F44=\"--\",F44=\"x\"),F44,($F$63*43560))","v":"--"},null,"Post-ReDevelopment Treatment Volume                  (cubic feet) ",{"$f":"IF(OR(I44=\"--\",I44=\"x\"),I44,($I$63*43560))","v":"--"},null,"Post-Development Treatment Volume (cubic feet) ",{"$f":"IF(F13=\"--\",\"--\",IF(P2>0,\"x\",IF($L$57=\"--\",\"--\",IFERROR($L$63*43560,$O$2))))","v":"--"}]
["Pre-ReDevelopment TP Load  (lb/yr)",{"$f":"IF(OR(B44=\"--\",B44=\"x\"),B44,(B44*B46+B48*B50+B52*B54+B56*B58))","v":"--"},{"$f":"IF(OR(C44=\"--\",C44=\"x\"),C44,(C44*C46+C48*C50+C52*C54+C56*C58))","v":"--"},{"$f":"IFERROR(IF(OR($C$60=0,$C$65=\"x\",$C$65=\"--\"),\"\",(IF((1-$I$67)*$C$65<($I$60*Constants!$B$3),\"*\",\"\"))),\"\")","v":""},"Final Post-Development TP Load                           (lb/yr)",{"$f":"IF(OR(F44=\"--\",F44=\"x\"),F44,(F44*F46+F48*F50+F52*F54+F56*F58))","v":"--"},{"$f":"IF($D$65=\"*\",\"*\",\"\")","v":""},"Post-ReDevelopment Load (TP)                           (lb/yr)*",{"$f":"IF(OR(I44=\"--\",I44=\"x\"),I44,(I44*I46+I48*I50+I52*I54+I56*I58))","v":"--"},null,"Post-Development TP Load (lb/yr)",{"$f":"IF(OR(L64=\"--\",L64=\"x\"),L64,IF($L$57=\"--\",\"--\",(IF(P2>0,$O$2,(L56*F58)))))","v":"--"}]
["Pre-ReDevelopment TP Load per acre\n(lb/acre/yr)",{"$f":"IF(OR(B44=\"--\",B44=\"x\"),B44,IF(B60>0,(ROUND(B65/B60,2)),\"\"))","v":"--"},{"$f":"IF(OR(C44=\"--\",C44=\"x\"),C44,IF(C60>0,(ROUND(C65/C60,2)),\"\"))","v":"--"},{"$f":"IF($D$65=\"*\",\"*\",\"\")","v":""},"Final Post-Development TP Load per acre \n(lb/acre/yr)",{"$f":"IF(OR(F44=\"--\",F44=\"x\"),F44,IF($F$60>0,(ROUND($F$65/$F$60,2)),\"\"))","v":"--"},null,"Post-ReDevelopment TP Load per acre \n(lb/acre/yr)",{"$f":"IF(OR(I44=\"--\",I44=\"x\"),I44,IF($I$60>0,(ROUND($I$65/$I$60,2)),\"\"))","v":"--"}]
["Baseline TP Load (lb/yr)\n(0.26 lbs/acre/yr applied to pre-redevelopment area excluding pervious land proposed for new impervious cover)",null,{"$f":"IF(OR(C44=\"--\",C44=\"x\"),C44,Constants!$B$3*C60)","v":"--"},{"$f":"IFERROR(IF(OR(C62=0,C67=\"x\"),\"\",(IF((1-I69)*C67<(I62*B39),\"*\",\"\"))),\"\")","v":""},null,null,null,"Max. Reduction Required \n(Below Pre-ReDevelopment Load)",{"$f":"IF(F10=0,\"--\",IF(E6=\"yes\",20%,IF($F$10<1,10%,20%)))","v":"--"}]
[]
["1Adjusted Land Cover Summary: \nPre ReDevelopment land cover minus pervious land cover (forest, mixed open or managed turf) acreage proposed for new impervious cover.  \n\nAdjusted total acreage is consistent with Post-ReDevelopment acreage (minus  acreage of new impervious cover).  \n\nColumn I shows load reduction requriement for new impervious cover (based on new development load limit, 0.26 lbs/acre/year). ",null,null,null,{"$f":"IF(P3=1,O3,IF(OR($F$21=0,$F$29=0),\"ENTER ALL AREA INPUTS ABOVE FOR RESULTS\",\"\"))","v":"ENTER ALL AREA INPUTS ABOVE FOR RESULTS"},null,{"$f":"IF($D$65=\"*\",\"*\",\"\")","v":""},"TP Load Reduction Required for Redeveloped Area (lb/yr)",{"$f":"IF(OR(I44=\"--\",I44=\"x\"),I44,(IF((1-I67)*C65<(I60*Constants!$B$3),I65-C60*Constants!$B$3,I65-(1-I67)*C65)))","v":"--"},null,"TP Load Reduction Required for New Impervious Area (lb/yr)",{"$f":"IF(OR(F44=\"--\",F44=\"x\"),F44,IF($L$57=\"--\",\"0\",(L65-L$56*Constants!B3)))","v":"--"}]
[null,null,null,null,null,null,{"$f":"IF($D$65=\"*\",\"*\",\"\")","v":""},{"$f":"IF(D65=\"*\",\"Reduction below new development load limitation not required\",\"\")","v":""}]

{"sheet":"D.A. A","index":3,"n_rows":340,"n_cols":24,"rows_kept":340,"cut":false,"hidden":false,"merged":[[64,14,64,15],[100,14,100,15],[101,14,101,15],[102,14,102,15],[91,14,91,15],[94,14,94,15],[95,14,95,15],[96,14,96,15],[97,14,97,15],[99,0,99,1],[80,16,80,17],[82,14,82,15],[83,14,83,15],[86,14,86,15],[87,14,87,15],[90,14,90,15],[80,1,80,2],[55,14,55,15],[58,14,58,15],[59,14,59,15],[62,14,62,15],[63,14,63,15],[54,14,54,15],[33,14,33,15],[34,14,34,15],[37,14,37,15],[38,14,38,15],[41,14,41,15],[42,14,42,15],[45,14,45,15],[46,14,46,15],[49,14,49,15],[50,14,50,15],[53,14,53,15],[32,14,32,15],[17,14,17,15],[18,14,18,15],[19,14,19,15],[20,14,20,15],[21,14,21,15],[22,14,22,15],[23,14,23,15],[24,14,24,15],[25,14,25,15],[28,14,28,15],[29,14,29,15],[14,14,14,15],[0,3,0,4],[7,9,7,12],[8,9,8,12],[11,14,11,15],[13,14,13,15],[10,14,10,15]]}
["Drainage Area A",null,null,null,null,null,null,null,null,null,null,null,null,"VRRM 4.1, 2024"]
[]
["Drainage Area A Land Cover  (acres)"]
[null,"A Soils","B Soils","C Soils","D Soils","Totals","Land Cover Rv","Composite Loading P",null,null,null,null,null,null,null,null,null,"Composite Loading N"]
["Forest (acres)",null,null,null,null,{"$f":"SUMIF(B5:E5,\">=0\")","v":0},{"$f":"IF(F5>0,(B5*Constants!$B$7+C5*Constants!$C$7+D5*Constants!$D$7+E5*Constants!$E$7)/F5,0)","v":0},{"$f":"IF(G5>0,(B5*Constants!$B14/F5)+(C5*Constants!$C14/F5)+(D5*Constants!$D14/F5)+(E5*Constants!$E14/F5),0)","v":0},null,null,null,null,null,null,null,null,null,{"$f":"IF(G5>0,(B5*Constants!$B21/F5)+(C5*Constants!$C21/F5)+(D5*Constants!$D21/F5)+(E5*Constants!$E21/F5),0)","v":0}]
["Mixed Open (acres)",null,null,null,null,{"$f":"SUMIF(B6:E6,\">=0\")","v":0},{"$f":"IF(F6>0,(B6*Constants!$B$8+C6*Constants!$C$8+D6*Constants!$D$8+E6*Constants!$E$8)/F6,0)","v":0},{"$f":"IF(G6>0,(B6*Constants!$B15/F6)+(C6*Constants!$C15/F6)+(D6*Constants!$D15/F6)+(E6*Constants!$E15/F6),0)","v":0},null,null,null,null,null,null,null,null,null,{"$f":"IF(G6>0,(B6*Constants!$B22/F6)+(C6*Constants!$C22/F6)+(D6*Constants!$D22/F6)+(E6*Constants!$E22/F6),0)","v":0}]
["Managed Turf (acres)",null,null,null,null,{"$f":"SUMIF(B7:E7,\">=0\")","v":0},{"$f":"IF(F7>0,(B7*Constants!$B$9+C7*Constants!$C$9+D7*Constants!$D$9+E7*Constants!$E$9)/F7,0)","v":0},{"$f":"IF(G7>0,(B7*Constants!$B16/F7)+(C7*Constants!$C16/F7)+(D7*Constants!$D16/F7)+(E7*Constants!$E16/F7),0)","v":0},null,null,null,null,null,null,null,null,null,{"$f":"IF(G7>0,(B7*Constants!$B23/F7)+(C7*Constants!$C23/F7)+(D7*Constants!$D23/F7)+(E7*Constants!$E23/F7),0)","v":0}]
["Impervious Cover (acres) ",null,null,null,null,{"$f":"SUMIF(B8:E8,\">=0\")","v":0},{"$f":"IF(F8>0,(B8*Constants!$B$10+C8*Constants!$C$10+D8*Constants!$D$10+E8*Constants!$E$10)/F8,0)","v":0},{"$f":"IF(G8>0,(B8*Constants!$B17/F8)+(C8*Constants!$C17/F8)+(D8*Constants!$D17/F8)+(E8*Constants!$E17/F8),0)","v":0},null,"     Total Phosphorus Available for Removal in D.A. A (lb/yr)",null,null,null,{"$f":"SUMPRODUCT(B6:E8,Constants!B15:E17)","v":0},null,null,null,{"$f":"IF(G8>0,(B8*Constants!$B24/F8)+(C8*Constants!$C24/F8)+(D8*Constants!$D24/F8)+(E8*Constants!$E24/F8),0)","v":0}]
[null,null,null,null,"Total",{"$f":"SUM(F5:F8)","v":0},null,null,null,"Post Development Treatment Volume in D.A. A (ft3)",null,null,null,{"$f":"IFERROR(Constants!$B$2/12*(F7*G7+F8*G8+F6*G6)/(F7+F8+F6)*(F7+F8+F6)*43560,0)","v":0}]
[]
["Stormwater Best Management Practices (RR = Runoff Reduction)",null,null,null,null,null,null,null,null,null,null,null,null,null,"--Select from dropdown lists--"]
["Practice","Runoff Reduction Credit (%)","Mixed Open Credit Area (acres) ","Managed Turf Credit Area (acres) ","Impervious Cover Credit Area (acres)","Volume from Upstream Practice (ft3)","Runoff Reduction (ft3)","Remaining Runoff Volume  (ft3)","Total BMP Treatment Volume (ft3)","Phosphorus Removal Efficiency (%)","Phosphorus Load from Upstream Practices (lb)","Untreated Phosphorus Load to Practice (lb)","Phosphorus Removed By Practice (lb)","Remaining Phosphorus Load (lb)","Downstream Practice to be Employed",null,null,"Nitrogen Removal Efficiency (%)","Nitrogen Load from Upstream  Practices (lbs)","Untreated Nitrogen Load to Practice (lbs)","Nitrogen Removed By Practice (lbs)","Remaining Nitrogen Load (lbs)"]
["1. Vegetated Roof (RR)",null,null,null,null,null,null,null,null,null,null,null,null,null,null,null,null,"1. Vegetated Roof (RR)"]
["1.a. Vegetated Roof #1 (P-FIL-02)",{"$f":"Constants!$B28","v":45},null,null,null,null,{"$f":"(Constants!$B$2*($G$8*$E14)*3630)*$B14/100","v":0},{"$f":"(Constants!$B$2*($G$8*$E14)*3630)*(1-$B14/100)","v":0},{"$f":"+$G14+$H14","v":0},{"$f":"Constants!C28","v":0},null,{"$f":"E14*$H$8","v":0},{"$f":"IFERROR($L14*($G14+$H14*$J14/100)/($I14),0)","v":0},{"$f":"$L14-$M14","v":0},null,null,null,{"$f":"Constants!$D28","v":0},null,{"$f":"E14*$R$8","v":0},{"$f":"IFERROR($T14*($G14+$H14*$R14/100)/$I14,0)","v":0},{"$f":"$T14-$U14","v":0}]
["1.b. Vegetated Roof #2 (P-FIL-02)",{"$f":"Constants!$B29","v":60},null,null,null,null,{"$f":"(Constants!$B$2*($G$8*$E15)*3630)*$B15/100","v":0},{"$f":"(Constants!$B$2*($G$8*$E15)*3630)*(1-$B15/100)","v":0},{"$f":"+$G15+$H15","v":0},{"$f":"Constants!C29","v":0},null,{"$f":"E15*$H$8","v":0},{"$f":"IFERROR($L15*($G15+$H15*$J15/100)/($I15),0)","v":0},{"$f":"$L15-$M15","v":0},null,null,null,{"$f":"Constants!$D29","v":0},null,{"$f":"E15*$R$8","v":0},{"$f":"IFERROR($T15*($G15+$H15*$R15/100)/$I15,0)","v":0},{"$f":"$T15-$U15","v":0}]
[]
["2. Rooftop Disconnection (RR)",null,null,null,null,null,null,null,null,null,null,null,null,null,null,null,null,"2. Rooftop Disconnection (RR)"]
["2.a. Simple Disconnection to A/B Soils \n(P-FIL-01)",{"$f":"Constants!$B32","v":50},null,null,null,{"$f":"SUMIF($O$14:$O$103,P136,$H$14:$H$103)","v":0},{"$f":"(Constants!$B$2*($G$8*$E18)*3630)*$B18/100","v":0},{"$f":"(Constants!$B$2*($G$8*$E18)*3630)*(1-$B18/100)","v":0},{"$f":"+$G18+$H18","v":0},{"$f":"Constants!C32","v":0},{"$f":"SUMIF($O$13:$O$103,P136,$N$13:$N$103)","v":0},{"$f":"E18*$H$8","v":0},{"$f":"IFERROR(($K18+$L18)*($G18+$H18*$J18/100)/$I18,0)","v":0},{"$f":"$K18+$L18-$M18","v":0},null,null,null,{"$f":"Constants!$D32","v":0},{"$f":"SUMIF($O$14:$O$103,$P136,$V$14:$V$103)","v":0},{"$f":"E18*$R$8","v":0},{"$f":"IFERROR(($S18+$T18)*($G18+$H18*$R18/100)/$I18,0)","v":0},{"$f":"$S18+$T18-$U18","v":0}]
["2.b. Simple Disconnection to C/D Soils \n(P-FIL-01)",{"$f":"Constants!$B33","v":25},null,null,null,0,{"$f":"(Constants!$B$2*($G$8*$E19)*3630)*$B19/100","v":0},{"$f":"(Constants!$B$2*($G$8*$E19)*3630)*(1-$B19/100)","v":0},{"$f":"+$G19+$H19","v":0},{"$f":"Constants!C33","v":0},0,{"$f":"E19*$H$8","v":0},{"$f":"IFERROR(($K19+$L19)*($G19+$H19*$J19/100)/$I19,0)","v":0},{"$f":"$K19+$L19-$M19","v":0},null,null,null,{"$f":"Constants!$D33","v":0},0,0,{"$f":"IFERROR(($S19+$T19)*($G19+$H19*$R19/100)/$I19,0)","v":0},{"$f":"$S19+$T19-$U19","v":0}]
["2.c. To Soil Amended Filter Path as per specifications (existing C/D soils) (P-FIL-08)",{"$f":"Constants!$B34","v":50},null,null,null,0,{"$f":"(Constants!$B$2*($G$8*$E20)*3630)*$B20/100","v":0},{"$f":"(Constants!$B$2*($G$8*$E20)*3630)*(1-$B20/100)","v":0},0,{"$f":"Constants!C34","v":0},0,{"$f":"E20*$H$8","v":0},0,0,null,null,null,{"$f":"Constants!$D34","v":0},0,0,0,0]
["2.d. To Dry Well or French Drain #1, \nMicro-Infilration #1 (P-FIL-04)",{"$f":"Constants!$B35","v":50},null,null,null,0,{"$f":"(Constants!$B$2*($G$8*$E21)*3630)*$B21/100","v":0},{"$f":"(Constants!$B$2*($G$8*$E21)*3630)*(1-$B21/100)","v":0},0,{"$f":"Constants!C35","v":25},0,0,0,{"$f":"$K21+$L21-$M21","v":0},null,null,null,{"$f":"Constants!$D35","v":15},0,0,0,0]
["2.e. To Dry Well or French Drain #2, \nMicro-Infiltration #2 (P-FIL-04)",{"$f":"Constants!$B36","v":90},null,null,null,0,{"$f":"(Constants!$B$2*($G$8*$E22)*3630)*$B22/100","v":0},{"$f":"(Constants!$B$2*($G$8*$E22)*3630)*(1-$B22/100)","v":0},0,{"$f":"Constants!C36","v":25},0,0,0,0,null,null,null,{"$f":"Constants!$D36","v":15},0,0,0,0]
["2.f. To Rain Garden #1, \nMicro-Bioretention #1 (P-FIL-05)",{"$f":"Constants!$B37","v":40},null,null,null,0,{"$f":"(Constants!$B$2*($G$8*$E23)*3630)*$B23/100","v":0},{"$f":"(Constants!$B$2*($G$8*$E23)*3630)*(1-$B23/100)","v":0},0,{"$f":"Constants!C37","v":25},0,0,0,0,null,null,null,{"$f":"Constants!$D37","v":40},0,0,0,0]
["2.g. To Rain Garden #2, \nMicro-Bioretention #2 (P-FIL-05)",{"$f":"Constants!$B38","v":80},null,null,null,0,{"$f":"(Constants!$B$2*($G$8*$E24)*3630)*$B24/100","v":0},{"$f":"(Constants!$B$2*($G$8*$E24)*3630)*(1-$B24/100)","v":0},{"$f":"+$G24+$H24","v":0},{"$f":"Constants!C38","v":50},0,0,0,0,null,null,null,{"$f":"Constants!$D38","v":60},0,0,0,0]
["2.h. To Rainwater Harvesting (P-BAS-04)",0,null,null,null,0,{"$f":"(Constants!$B$2*($G$8*$E25)*3630)*$B25/100","v":0},{"$f":"(Constants!$B$2*($G$8*$E25)*3630)*(1-$B25/100)","v":0},0,{"$f":"Constants!C39","v":0},0,0,0,0,null,null,null,{"$f":"Constants!$D39","v":0},0,0,0,0]
["2.i. To Stormwater Planter, \nUrban Bioretention (P-FIL-05)",{"$f":"Constants!$B40","v":40},null,null,null,0,{"$f":"(Constants!$B$2*($G$8*$E26)*3630)*$B26/100","v":0},{"$f":"(Constants!$B$2*($G$8*$E26)*3630)*(1-$B26/100)","v":0},0,{"$f":"Constants!C40","v":25},0,0,{"$f":"IFERROR(($K26+$L26)*($G26+$H26*$J26/100)/$I26,0)","v":0},0,null,null,null,{"$f":"Constants!$D40","v":40},0,0,0,0]
[]
["3. Permeable Pavement  (RR)",null,null,null,null,null,null,null,null,null,null,null,null,null,null,null,null,"3. Permeable Pavement  (RR)"]
["3.a. Permeable Pavement #1 (P-FIL-03)",{"$f":"Constants!$B43","v":45},null,null,null,{"$f":"SUMIF($O$14:$O$103,P145,$H$14:$H$103)","v":0},{"$f":"(Constants!$B$2*($G$8*$E29)*3630)*$B29/100","v":0},{"$f":"(Constants!$B$2*($G$8*$E29)*3630)*(1-$B29/100)","v":0},{"$f":"+$G29+$H29","v":0},{"$f":"Constants!C43","v":25},{"$f":"SUMIF($O$13:$O$103,P145,$N$13:$N$103)","v":0},{"$f":"E29*$H$8","v":0},{"$f":"IFERROR(($K29+$L29)*($G29+$H29*$J29/100)/$I29,0)","v":0},{"$f":"$K29+$L29-$M29","v":0},null,null,null,{"$f":"Constants!$D43","v":25},{"$f":"SUMIF($O$14:$O$103,$P145,$V$14:$V$103)","v":0},{"$f":"E29*$R$8","v":0},{"$f":"IFERROR(($S29+$T29)*($G29+$H29*$R29/100)/$I29,0)","v":0},{"$f":"$S29+$T29-$U29","v":0}]
["3.b. Permeable Pavement #2 (P-FIL-03)",{"$f":"Constants!$B44","v":75},null,null,null,null,{"$f":"(Constants!$B$2*($G$8*$E30)*3630)*$B30/100","v":0},{"$f":"(Constants!$B$2*($G$8*$E30)*3630)*(1-$B30/100)","v":0},{"$f":"+$G30+$H30","v":0},{"$f":"Constants!C44","v":25},null,{"$f":"E30*$H$8","v":0},{"$f":"IFERROR(($K30+$L30)*($G30+$H30*$J30/100)/$I30,0)","v":0},{"$f":"$L30-$M30","v":0},null,null,null,{"$f":"Constants!$D44","v":25},null,{"$f":"E30*$R$8","v":0},{"$f":"IFERROR(($S30+$T30)*($G30+$H30*$R30/100)/$I30,0)","v":0},{"$f":"$S30+$T30-$U30","v":0}]
[]
["4. Grass Channel (RR)",null,null,null,null,null,null,null,null,null,null,null,null,null,null,null,null,"4. Grass Channel (RR)"]
["4.a. Grass Channel A/B Soils (P-CNV-01)",{"$f":"Constants!$B47","v":20},null,null,null,{"$f":"SUMIF($O$14:$O$103,P146,$H$14:$H$103)","v":0},{"$f":"(Constants!$B$2*($G$7*$D33+$G$8*$E33+$C33*$G$6)*3630+$F33)*$B33/100","v":0},{"$f":"(Constants!$B$2*($G$7*$D33+$G$8*$E33+$C33*$G$6)*3630+$F33)*(1-$B33/100)","v":0},{"$f":"+$G33+$H33","v":0},{"$f":"Constants!C47","v":15},{"$f":"SUMIF($O$13:$O$103,P146,$N$13:$N$103)","v":0},{"$f":"(D33*$H$7)+(C33*$H$6)+(E33*$H$8)","v":0},{"$f":"IFERROR(($K33+$L33)*($G33+$H33*$J33/100)/$I33,0)","v":0},{"$f":"$K33+$L33-$M33","v":0},null,null,null,{"$f":"Constants!$D47","v":20},{"$f":"SUMIF($O$14:$O$103,$P146,$V$14:$V$103)","v":0},{"$f":"(D33*$R$7)+(C33*$R$6)+(E33*$R$8)","v":0},{"$f":"IFERROR(($S33+$T33)*($G33+$H33*$R33/100)/$I33,0)","v":0},{"$f":"$S33+$T33-$U33","v":0}]
["4.b. Grass Channel C/D Soils (P-CNV-01)",{"$f":"Constants!$B48","v":10},null,null,null,{"$f":"SUMIF($O$14:$O$103,P147,$H$14:$H$103)","v":0},{"$f":"(Constants!$B$2*($G$7*$D34+$G$8*$E34+$C34*$G$6)*3630+$F34)*$B34/100","v":0},{"$f":"(Constants!$B$2*($G$7*$D34+$G$8*$E34+$C34*$G$6)*3630+$F34)*(1-$B34/100)","v":0},{"$f":"+$G34+$H34","v":0},{"$f":"Constants!C48","v":15},{"$f":"SUMIF($O$13:$O$103,P147,$N$13:$N$103)","v":0},{"$f":"(D34*$H$7)+(C34*$H$6)+(E34*$H$8)","v":0},{"$f":"IFERROR(($K34+$L34)*($G34+$H34*$J34/100)/$I34,0)","v":0},{"$f":"$K34+$L34-$M34","v":0},null,null,null,{"$f":"Constants!$D48","v":20},{"$f":"SUMIF($O$14:$O$103,$P147,$V$14:$V$103)","v":0},{"$f":"(D34*$R$7)+(C34*$R$6)+(E34*$R$8)","v":0},{"$f":"IFERROR(($S34+$T34)*($G34+$H34*$R34/100)/$I34,0)","v":0},{"$f":"$S34+$T34-$U34","v":0}]
["4.c. Grass Channel with Compost Amended Soils as per specs (P-FIL-08)",{"$f":"Constants!$B49","v":20},null,null,null,{"$f":"SUMIF($O$14:$O$103,P148,$H$14:$H$103)","v":0},{"$f":"(Constants!$B$2*($G$7*$D35+$G$8*$E35+$C35*$G$6)*3630+$F35)*$B35/100","v":0},{"$f":"(Constants!$B$2*($G$7*$D35+$G$8*$E35+$C35*$G$6)*3630+$F35)*(1-$B35/100)","v":0},{"$f":"+$G35+$H35","v":0},{"$f":"Constants!C49","v":15},{"$f":"SUMIF($O$13:$O$103,P148,$N$13:$N$103)","v":0},{"$f":"(D35*$H$7)+(C35*$H$6)+(E35*$H$8)","v":0},{"$f":"IFERROR(($K35+$L35)*($G35+$H35*$J35/100)/$I35,0)","v":0},{"$f":"$K35+$L35-$M35","v":0},null,null,null,{"$f":"Constants!$D49","v":20},{"$f":"SUMIF($O$14:$O$103,$P148,$V$14:$V$103)","v":0},{"$f":"(D35*$R$7)+(C35*$R$6)+(E35*$R$8)","v":0},{"$f":"IFERROR(($S35+$T35)*($G35+$H35*$R35/100)/$I35,0)","v":0},{"$f":"$S35+$T35-$U35","v":0}]
[null,null,null,null,null,null,null,null,null,null,null,null,null,null,null,null,null,null,null,null,null,null,null,"`"]
["5. Dry Swale (RR)",null,null,null,null,null,null,null,null,null,null,null,null,null,null,null,null,"5. Dry Swale (RR)"]
["5.a. Dry Swale #1 (P-CNV-02)",{"$f":"Constants!$B52","v":40},null,null,null,{"$f":"SUMIF($O$14:$O$103,P149,$H$14:$H$103)","v":0},{"$f":"(Constants!$B$2*($G$7*$D38+$G$8*$E38+$C38*$G$6)*3630+$F38)*$B38/100","v":0},{"$f":"(Constants!$B$2*($G$7*$D38+$G$8*$E38+$C38*$G$6)*3630+$F38)*(1-$B38/100)","v":0},{"$f":"+$G38+$H38","v":0},{"$f":"Constants!C52","v":20},{"$f":"SUMIF($O$13:$O$103,P149,$N$13:$N$103)","v":0},{"$f":"(D38*$H$7)+(C38*$H$6)+(E38*$H$8)","v":0},{"$f":"IFERROR(($K38+$L38)*($G38+$H38*$J38/100)/$I38,0)","v":0},{"$f":"$K38+$L38-$M38","v":0},null,null,null,{"$f":"Constants!$D52","v":25},{"$f":"SUMIF($O$14:$O$103,$P149,$V$14:$V$103)","v":0},{"$f":"(D38*$R$7)+(C38*$R$6)+(E38*$R$8)","v":0},{"$f":"IFERROR(($S38+$T38)*($G38+$H38*$R38/100)/$I38,0)","v":0},{"$f":"$S38+$T38-$U38","v":0}]
["5.b. Dry Swale #2 (P-CNV-02)",{"$f":"Constants!$B53","v":60},null,null,null,{"$f":"SUMIF($O$14:$O$103,P150,$H$14:$H$103)","v":0},{"$f":"(Constants!$B$2*($G$7*$D39+$G$8*$E39+$C39*$G$6)*3630+$F39)*$B39/100","v":0},{"$f":"(Constants!$B$2*($G$7*$D39+$G$8*$E39+$C39*$G$6)*3630+$F39)*(1-$B39/100)","v":0},{"$f":"+$G39+$H39","v":0},{"$f":"Constants!C53","v":40},{"$f":"SUMIF($O$13:$O$103,P150,$N$13:$N$103)","v":0},{"$f":"(D39*$H$7)+(C39*$H$6)+(E39*$H$8)","v":0},{"$f":"IFERROR(($K39+$L39)*($G39+$H39*$J39/100)/$I39,0)","v":0},{"$f":"$K39+$L39-$M39","v":0},null,null,null,{"$f":"Constants!$D53","v":35},{"$f":"SUMIF($O$14:$O$103,$P150,$V$14:$V$103)","v":0},{"$f":"(D39*$R$7)+(C39*$R$6)+(E39*$R$8)","v":0},{"$f":"IFERROR(($S39+$T39)*($G39+$H39*$R39/100)/$I39,0)","v":0},{"$f":"$S39+$T39-$U39","v":0}]
[]
["6. Bioretention (RR)",null,null,null,null,null,null,null,null,null,null,null,null,null,null,null,null,"6. Bioretention (RR)"]
["6.a. Bioretention #1 or Micro-Bioretention #1 or Urban Bioretention (P-FIL-05)",{"$f":"Constants!$B56","v":40},null,null,null,{"$f":"SUMIF($O$14:$O$103,P151,$H$14:$H$103)","v":0},{"$f":"(Constants!$B$2*($G$7*$D42+$G$8*$E42+$C42*$G$6)*3630+$F42)*$B42/100","v":0},{"$f":"(Constants!$B$2*($G$7*$D42+$G$8*$E42+$C42*$G$6)*3630+$F42)*(1-$B42/100)","v":0},{"$f":"+$G42+$H42","v":0},{"$f":"Constants!C56","v":25},{"$f":"SUMIF($O$13:$O$103,P151,$N$13:$N$103)","v":0},{"$f":"(D42*$H$7)+(C42*$H$6)+(E42*$H$8)","v":0},{"$f":"IFERROR(($K42+$L42)*($G42+$H42*$J42/100)/$I42,0)","v":0},{"$f":"$K42+$L42-$M42","v":0},null,null,null,{"$f":"Constants!$D56","v":40},{"$f":"SUMIF($O$14:$O$103,$P151,$V$14:$V$103)","v":0},{"$f":"(D42*$R$7)+(C42*$R$6)+(E42*$R$8)","v":0},{"$f":"IFERROR(($S42+$T42)*($G42+$H42*$R42/100)/$I42,0)","v":0},{"$f":"$S42+$T42-$U42","v":0}]
["6.b. Bioretention #2 or \nMicro-Bioretention #2 (P-FIL-05)",{"$f":"Constants!$B57","v":80},null,null,null,{"$f":"SUMIF($O$14:$O$103,P152,$H$14:$H$103)","v":0},{"$f":"(Constants!$B$2*($G$7*$D43+$G$8*$E43+$C43*$G$6)*3630+$F43)*$B43/100","v":0},{"$f":"(Constants!$B$2*($G$7*$D43+$G$8*$E43+$C43*$G$6)*3630+$F43)*(1-$B43/100)","v":0},{"$f":"+$G43+$H43","v":0},{"$f":"Constants!C57","v":50},{"$f":"SUMIF($O$13:$O$103,P152,$N$13:$N$103)","v":0},{"$f":"(D43*$H$7)+(C43*$H$6)+(E43*$H$8)","v":0},{"$f":"IFERROR(($K43+$L43)*($G43+$H43*$J43/100)/$I43,0)","v":0},{"$f":"$K43+$L43-$M43","v":0},null,null,null,{"$f":"Constants!$D57","v":60},{"$f":"SUMIF($O$14:$O$103,$P152,$V$14:$V$103)","v":0},{"$f":"(D43*$R$7)+(C43*$R$6)+(E43*$R$8)","v":0},{"$f":"IFERROR(($S43+$T43)*($G43+$H43*$R43/100)/$I43,0)","v":0},{"$f":"$S43+$T43-$U43","v":0}]
[]
["7. Infiltration (RR)",null,null,null,null,null,null,null,null,null,null,null,null,null,null,null,null,"7. Infiltration (RR)"]
["7.a. Infiltration #1 (P-FIL-04)",{"$f":"Constants!$B60","v":50},null,null,null,{"$f":"SUMIF($O$14:$O$103,P153,$H$14:$H$103)","v":0},{"$f":"(Constants!$B$2*($G$7*$D46+$G$8*$E46+$C46*$G$6)*3630+$F46)*$B46/100","v":0},{"$f":"(Constants!$B$2*($G$7*$D46+$G$8*$E46+$C46*$G$6)*3630+$F46)*(1-$B46/100)","v":0},{"$f":"+$G46+$H46","v":0},{"$f":"Constants!C60","v":25},{"$f":"SUMIF($O$13:$O$103,P153,$N$13:$N$103)","v":0},{"$f":"(D46*$H$7)+(C46*$H$6)+(E46*$H$8)","v":0},{"$f":"IFERROR(($K46+$L46)*($G46+$H46*$J46/100)/$I46,0)","v":0},{"$f":"$K46+$L46-$M46","v":0},null,null,null,{"$f":"Constants!$D60","v":15},{"$f":"SUMIF($O$14:$O$103,$P153,$V$14:$V$103)","v":0},{"$f":"(D46*$R$7)+(C46*$R$6)+(E46*$R$8)","v":0},{"$f":"IFERROR(($S46+$T46)*($G46+$H46*$R46/100)/$I46,0)","v":0},{"$f":"$S46+$T46-$U46","v":0}]
["7.b. Infiltration #2 (P-FIL-04)",{"$f":"Constants!$B61","v":90},null,null,null,{"$f":"SUMIF($O$14:$O$103,P154,$H$14:$H$103)","v":0},{"$f":"(Constants!$B$2*($G$7*$D47+$G$8*$E47+$C47*$G$6)*3630+$F47)*$B47/100","v":0},{"$f":"(Constants!$B$2*($G$7*$D47+$G$8*$E47+$C47*$G$6)*3630+$F47)*(1-$B47/100)","v":0},{"$f":"+$G47+$H47","v":0},{"$f":"Constants!C61","v":25},{"$f":"SUMIF($O$13:$O$103,P154,$N$13:$N$103)","v":0},{"$f":"(D47*$H$7)+(C47*$H$6)+(E47*$H$8)","v":0},{"$f":"IFERROR(($K47+$L47)*($G47+$H47*$J47/100)/$I47,0)","v":0},{"$f":"$K47+$L47-$M47","v":0},null,null,null,{"$f":"Constants!$D61","v":15},{"$f":"SUMIF($O$14:$O$103,$P154,$V$14:$V$103)","v":0},{"$f":"(D47*$R$7)+(C47*$R$6)+(E47*$R$8)","v":0},{"$f":"IFERROR(($S47+$T47)*($G47+$H47*$R47/100)/$I47,0)","v":0},{"$f":"$S47+$T47-$U47","v":0}]
[]
["8. Extended Detention Pond (RR)",null,null,null,null,null,null,null,null,null,null,null,null,null,null,null,null,"8. Extended Detention Pond (RR)"]
["8.a. ED #1 (P-BAS-03)",{"$f":"Constants!$B64","v":0},null,null,null,{"$f":"SUMIF($O$14:$O$103,P155,$H$14:$H$103)","v":0},{"$f":"(Constants!$B$2*($G$7*$D50+$G$8*$E50+$C50*$G$6)*3630+$F50)*$B50/100","v":0},{"$f":"(Constants!$B$2*($G$7*$D50+$G$8*$E50+$C50*$G$6)*3630+$F50)*(1-$B50/100)","v":0},{"$f":"+$G50+$H50","v":0},{"$f":"Constants!C64","v":15},{"$f":"SUMIF($O$13:$O$103,P155,$N$13:$N$103)","v":0},{"$f":"(D50*$H$7)+(C50*$H$6)+(E50*$H$8)","v":0},{"$f":"IFERROR(($K50+$L50)*($G50+$H50*$J50/100)/$I50,0)","v":0},{"$f":"$K50+$L50-$M50","v":0},null,null,null,{"$f":"Constants!$D64","v":10},{"$f":"SUMIF($O$14:$O$103,$P155,$V$14:$V$103)","v":0},{"$f":"(D50*$R$7)+(C50*$R$6)+(E50*$R$8)","v":0},{"$f":"IFERROR(($S50+$T50)*($G50+$H50*$R50/100)/$I50,0)","v":0},{"$f":"$S50+$T50-$U50","v":0}]
["8.b. ED #2 (P-BAS-03)",{"$f":"Constants!$B65","v":15},null,null,null,{"$f":"SUMIF($O$14:$O$103,P156,$H$14:$H$103)","v":0},{"$f":"(Constants!$B$2*($G$7*$D51+$G$8*$E51+$C51*$G$6)*3630+$F51)*$B51/100","v":0},{"$f":"(Constants!$B$2*($G$7*$D51+$G$8*$E51+$C51*$G$6)*3630+$F51)*(1-$B51/100)","v":0},{"$f":"+$G51+$H51","v":0},{"$f":"Constants!C65","v":15},{"$f":"SUMIF($O$13:$O$103,P156,$N$13:$N$103)","v":0},{"$f":"(D51*$H$7)+(C51*$H$6)+(E51*$H$8)","v":0},{"$f":"IFERROR(($K51+$L51)*($G51+$H51*$J51/100)/$I51,0)","v":0},{"$f":"$K51+$L51-$M51","v":0},null,null,null,{"$f":"Constants!$D65","v":10},{"$f":"SUMIF($O$14:$O$103,$P156,$V$14:$V$103)","v":0},{"$f":"(D51*$R$7)+(C51*$R$6)+(E51*$R$8)","v":0},{"$f":"IFERROR(($S51+$T51)*($G51+$H51*$R51/100)/$I51,0)","v":0},{"$f":"$S51+$T51-$U51","v":0}]
[]
["9. Sheetflow to Filter/Open Space (RR)",null,null,null,null,null,null,null,null,null,null,null,null,null,null,null,null,"9. Sheetflow to Filter/Open Space (RR)"]
["9.a. Sheetflow to Conservation Area, A/B Soils (P-FIL-07)",{"$f":"Constants!$B68","v":75},null,null,null,{"$f":"SUMIF($O$14:$O$103,P157,$H$14:$H$103)","v":0},{"$f":"(Constants!$B$2*($G$7*$D54+$G$8*$E54+$C54*$G$6)*3630+$F54)*$B54/100","v":0},{"$f":"(Constants!$B$2*($G$7*$D54+$G$8*$E54+$C54*$G$6)*3630+$F54)*(1-$B54/100)","v":0},{"$f":"+$G54+$H54","v":0},{"$f":"Constants!C68","v":0},{"$f":"SUMIF($O$13:$O$103,P157,$N$13:$N$103)","v":0},{"$f":"(D54*$H$7)+(C54*$H$6)+(E54*$H$8)","v":0},{"$f":"IFERROR(($K54+$L54)*($G54+$H54*$J54/100)/$I54,0)","v":0},{"$f":"$K54+$L54-$M54","v":0},null,null,null,{"$f":"Constants!$D68","v":0},{"$f":"SUMIF($O$14:$O$103,$P157,$V$14:$V$103)","v":0},{"$f":"(D54*$R$7)+(C54*$R$6)+(E54*$R$8)","v":0},{"$f":"IFERROR(($S54+$T54)*($G54+$H54*$R54/100)/$I54,0)","v":0},{"$f":"$S54+$T54-$U54","v":0}]
["9.b. Sheetflow to Conservation Area, C/D Soils (P-FIL-07)",{"$f":"Constants!$B69","v":50},null,null,null,{"$f":"SUMIF($O$14:$O$103,P158,$H$14:$H$103)","v":0},{"$f":"(Constants!$B$2*($G$7*$D55+$G$8*$E55+$C55*$G$6)*3630+$F55)*$B55/100","v":0},{"$f":"(Constants!$B$2*($G$7*$D55+$G$8*$E55+$C55*$G$6)*3630+$F55)*(1-$B55/100)","v":0},{"$f":"+$G55+$H55","v":0},{"$f":"Constants!C69","v":0},{"$f":"SUMIF($O$13:$O$103,P158,$N$13:$N$103)","v":0},{"$f":"(D55*$H$7)+(C55*$H$6)+(E55*$H$8)","v":0},{"$f":"IFERROR(($K55+$L55)*($G55+$H55*$J55/100)/$I55,0)","v":0},{"$f":"$K55+$L55-$M55","v":0},null,null,null,{"$f":"Constants!$D69","v":0},{"$f":"SUMIF($O$14:$O$103,$P158,$V$14:$V$103)","v":0},{"$f":"(D55*$R$7)+(C55*$R$6)+(E55*$R$8)","v":0},{"$f":"IFERROR(($S55+$T55)*($G55+$H55*$R55/100)/$I55,0)","v":0},{"$f":"$S55+$T55-$U55","v":0}]
["9.c. Sheetflow to Vegetated Filter Strip, A Soils or Compost Amended B/C/D Soils \n(Spec P-FIL-07 & P-FIL-08)",{"$f":"Constants!$B70","v":50},null,null,null,{"$f":"SUMIF($O$14:$O$103,P159,$H$14:$H$103)","v":0},{"$f":"(Constants!$B$2*($G$7*$D56+$G$8*$E56+$C56*$G$6)*3630+$F56)*$B56/100","v":0},{"$f":"(Constants!$B$2*($G$7*$D56+$G$8*$E56+$C56*$G$6)*3630+$F56)*(1-$B56/100)","v":0},{"$f":"+$G56+$H56","v":0},{"$f":"Constants!C70","v":0},{"$f":"SUMIF($O$13:$O$103,P159,$N$13:$N$103)","v":0},{"$f":"(D56*$H$7)+(C56*$H$6)+(E56*$H$8)","v":0},{"$f":"IFERROR(($K56+$L56)*($G56+$H56*$J56/100)/$I56,0)","v":0},{"$f":"$K56+$L56-$M56","v":0},null,null,null,{"$f":"Constants!$D70","v":0},{"$f":"SUMIF($O$14:$O$103,$P159,$V$14:$V$103)","v":0},{"$f":"(D56*$R$7)+(C56*$R$6)+(E56*$R$8)","v":0},{"$f":"IFERROR(($S56+$T56)*($G56+$H56*$R56/100)/$I56,0)","v":0},{"$f":"$S56+$T56-$U56","v":0}]
[]
["10. Regenerative Stormwater Conveyance",null,null,null,null,null,null,null,null,null,null,null,null,null,null,null,null,"10. Regenerative Stormwater Conveyance"]
["10.a. Regenerative Stormwater Conveyance (P-CNV-04)",{"$f":"Constants!$B73","v":0},null,null,null,{"$f":"SUMIF($O$14:$O$103,P160,$H$14:$H$103)","v":0},{"$f":"(Constants!$B$2*($G$7*$D59+$G$8*$E59+$C59*$G$6)*3630+$F59)*$B59/100","v":0},{"$f":"(Constants!$B$2*($G$7*$D59+$G$8*$E59+$C59*$G$6)*3630+$F59)*(1-$B59/100)","v":0},{"$f":"+$G59+$H59","v":0},{"$f":"Constants!C73","v":20},{"$f":"SUMIF($O$13:$O$103,P160,$N$13:$N$103)","v":0},{"$f":"(D59*$H$7)+(C59*$H$6)+(E59*$H$8)","v":0},{"$f":"IFERROR(($K59+$L59)*($G59+$H59*$J59/100)/$I59,0)","v":0},{"$f":"$K59+$L59-$M59","v":0},null,null,null,{"$f":"Constants!$D73","v":25},{"$f":"SUMIF($O$14:$O$103,$P160,$V$14:$V$103)","v":0},{"$f":"(D59*$R$7)+(C59*$R$6)+(E59*$R$8)","v":0},{"$f":"IFERROR(($S59+$T59)*($G59+$H59*$R59/100)/$I59,0)","v":0},{"$f":"$S59+$T59-$U59","v":0}]
["10.b. Regenerative Stormwater Conveyance (P-CNV-04)",{"$f":"Constants!$B74","v":0},null,null,null,{"$f":"SUMIF($O$14:$O$103,P161,$H$14:$H$103)","v":0},{"$f":"(Constants!$B$2*($G$7*$D60+$G$8*$E60+$C60*$G$6)*3630+$F60)*$B60/100","v":0},{"$f":"(Constants!$B$2*($G$7*$D60+$G$8*$E60+$C60*$G$6)*3630+$F60)*(1-$B60/100)","v":0},{"$f":"+$G60+$H60","v":0},{"$f":"Constants!C74","v":40},{"$f":"SUMIF($O$13:$O$103,P161,$N$13:$N$103)","v":0},0,0,{"$f":"$K60+$L60-$M60","v":0},null,null,null,{"$f":"Constants!$D74","v":35},{"$f":"SUMIF($O$14:$O$103,$P161,$V$14:$V$103)","v":0},{"$f":"(D60*$R$7)+(C60*$R$6)+(E60*$R$8)","v":0},{"$f":"IFERROR(($S60+$T60)*($G60+$H60*$R60/100)/$I60,0)","v":0},{"$f":"$S60+$T60-$U60","v":0}]
[]
["11. Tree BMP",null,null,null,null,null,null,null,null,null,null,null,null,null,null,null,null,"11. Tree BMP"]
["11.a. Trees over Pervious, A/B (P-FIL-09)",{"$f":"Constants!$B77","v":16},null,null,null,{"$f":"SUMIF($O$14:$O$103,P162,$H$14:$H$103)","v":0},{"$f":"(Constants!$B$2*($G$7*$D63+$G$8*$E63+$C63*$G$6)*3630+$F63)*$B63/100","v":0},{"$f":"(Constants!$B$2*($G$7*$D63+$G$8*$E63+$C63*$G$6)*3630+$F63)*(1-$B63/100)","v":0},{"$f":"+$G63+$H63","v":0},{"$f":"Constants!C77","v":0},{"$f":"SUMIF($O$13:$O$103,P162,$N$13:$N$103)","v":0},{"$f":"(D63*$H$7)+(C63*$H$6)+(E63*$H$8)","v":0},{"$f":"IFERROR(($K63+$L63)*($G63+$H63*$J63/100)/$I63,0)","v":0},{"$f":"$K63+$L63-$M63","v":0},null,null,null,{"$f":"Constants!$D77","v":0},{"$f":"SUMIF($O$14:$O$103,$P162,$V$14:$V$103)","v":0},{"$f":"(D63*$R$7)+(C63*$R$6)+(E63*$R$8)","v":0},{"$f":"IFERROR(($S63+$T63)*($G63+$H63*$R63/100)/$I63,0)","v":0},{"$f":"$S63+$T63-$U63","v":0}]
["11.b. Trees over Pervious, C/D (P-FIL-09)",{"$f":"Constants!$B78","v":12},null,null,null,{"$f":"SUMIF($O$14:$O$103,P163,$H$14:$H$103)","v":0},{"$f":"(Constants!$B$2*($G$7*$D64+$G$8*$E64+$C64*$G$6)*3630+$F64)*$B64/100","v":0},{"$f":"(Constants!$B$2*($G$7*$D64+$G$8*$E64+$C64*$G$6)*3630+$F64)*(1-$B64/100)","v":0},{"$f":"+$G64+$H64","v":0},{"$f":"Constants!C78","v":0},{"$f":"SUMIF($O$13:$O$103,P163,$N$13:$N$103)","v":0},0,{"$f":"IFERROR(($K64+$L64)*($G64+$H64*$J64/100)/$I64,0)","v":0},{"$f":"$K64+$L64-$M64","v":0},null,null,null,{"$f":"Constants!$D78","v":0},{"$f":"SUMIF($O$14:$O$103,$P163,$V$14:$V$103)","v":0},{"$f":"(D64*$R$7)+(C64*$R$6)+(E64*$R$8)","v":0},{"$f":"IFERROR(($S64+$T64)*($G64+$H64*$R64/100)/$I64,0)","v":0},{"$f":"$S64+$T64-$U64","v":0}]
["11.c. Trees over Impervious (P-FIL-09)",{"$f":"Constants!$B79","v":3.5},null,null,null,{"$f":"SUMIF($O$14:$O$103,P164,$H$14:$H$103)","v":0},{"$f":"(Constants!$B$2*($G$7*$D65+$G$8*$E65+$C65*$G$6)*3630+$F65)*$B65/100","v":0},{"$f":"(Constants!$B$2*($G$7*$D65+$G$8*$E65+$C65*$G$6)*3630+$F65)*(1-$B65/100)","v":0},{"$f":"+$G65+$H65","v":0},{"$f":"Constants!C79","v":0},{"$f":"SUMIF($O$13:$O$103,P164,$N$13:$N$103)","v":0},{"$f":"(D65*$H$7)+(C65*$H$6)+(E65*$H$8)","v":0},{"$f":"IFERROR(($K65+$L65)*($G65+$H65*$J65/100)/$I65,0)","v":0},{"$f":"$K65+$L65-$M65","v":0},null,null,null,{"$f":"Constants!$D79","v":0},{"$f":"SUMIF($O$14:$O$103,$P164,$V$14:$V$103)","v":0},{"$f":"(D65*$R$7)+(C65*$R$6)+(E65*$R$8)","v":0},{"$f":"IFERROR(($S65+$T65)*($G65+$H65*$R65/100)/$I65,0)","v":0},{"$f":"$S65+$T65-$U65","v":0}]
[]
[]
[null,null,null,null,"TOTAL IMPERVIOUS COVER TREATED (ac)",{"$f":"SUM(E14:E65)","v":0},"AREA CHECK:",{"$f":"IF(F68>$F$8,\"AREA EXCEEDED!\",\"OK.\")","v":"OK."}]
[null,null,null,null,"TOTAL MIXED OPEN TREATED (ac)",{"$f":"SUM(C14:C65)","v":0},"AREA CHECK:",{"$f":"IF(F69>$F$6,\"AREA EXCEEDED!\",\"OK.\")","v":"OK."}]
[null,null,null,null,"TOTAL MANAGED TURF AREA TREATED (ac)",{"$f":"SUM(D33:D65)","v":0},"AREA CHECK:",{"$f":"IF(F70>$F$7,\"AREA EXCEEDED!\",\"OK.\")","v":"OK."}]
[null,null,null,null,"TOTAL RUNOFF REDUCTION IN D.A. A (ft3)",{"$f":"IFERROR(SUM($G$14:$G$65),0)","v":0}]
[]
[null,null,null,null,null,null,null,"TOTAL PHOSPHORUS AVAILABLE FOR REMOVAL IN D.A. A (lb/yr)",{"$f":"$N$8","v":0},null,null,null,null,null,null,null,null,null,null,null,null,"TOTAL RUNOFF REDUCTION IN D.A. A (ft3)",{"$f":"F71","v":0}]
[null,null,null,null,null,null,null,"TOTAL PHOSPHORUS REMOVED WITH RUNOFF REDUCTION PRACTICES IN D.A. A (lb/yr)",{"$f":"IFERROR(SUM(M14:M65),0)","v":0},null,null,null,null,null,null,null,null,null,null,null,null,"NITROGEN REMOVED WITH RUNOFF REDUCTION PRACTICES IN D.A. A (lb/yr)",{"$f":"SUM($U$14:$U$65)","v":0}]
[null,null,null,null,null,null,null,"TOTAL PHOSPHORUS REMAINING AFTER APPLYING RUNOFF REDUCTION PRACTICES IN D.A. A (lb/yr)",{"$f":"I73-I74","v":0}]
[null,null,null,null,null,null,null,null,null,null,null,null,null,null,null,null,null,null,null,null,null,null,"           SEE WATER QUALITY COMPLIANCE TAB FOR SITE CALCULATIONS (Information Only)"]
[null,null,"SEE WATER QUALITY COMPLIANCE TAB FOR SITE COMPLIANCE CALCULATIONS"]
[]
[]
[]
[]
["12. Wet Swale (no RR)",null,null,null,null,null,null,null,null,null,null,null,null,null,null,null,null,"12. Wet Swale (Coastal Plain) (no RR)"]
["12.a. Wet Swale #1 (P-CNV-03)",{"$f":"Constants!$B82","v":0},null,null,null,{"$f":"SUMIF($O$14:$O$103,P165,$H$14:$H$103)","v":0},{"$f":"(Constants!$B$2*($G$7*$D83+$G$8*$E83+$C83*$G$6)*3630+$F83)*$B83/100","v":0},{"$f":"(Constants!$B$2*($G$7*$D83+$G$8*$E83+$C83*$G$6)*3630+$F83)*(1-$B83/100)","v":0},{"$f":"+$G83+$H83","v":0},{"$f":"Constants!C82","v":20},{"$f":"SUMIF($O$13:$O$103,P165,$N$13:$N$103)","v":0},{"$f":"(D83*$H$7)+(C83*$H$6)+(E83*$H$8)","v":0},{"$f":"IFERROR(($K83+$L83)*($G83+$H83*$J83/100)/$I83,0)","v":0},{"$f":"$K83+$L83-$M83","v":0},null,null,null,{"$f":"Constants!$D82","v":25},{"$f":"SUMIF($O$14:$O$103,$P165,$V$14:$V$103)","v":0},{"$f":"(D83*$R$7)+(C83*$R$6)+(E83*$R$8)","v":0},{"$f":"IFERROR(($S83+$T83)*($G83+$H83*$R83/100)/$I83,0)","v":0},{"$f":"$S83+$T83-$U83","v":0}]
["12.b. Wet Swale #2 (P-CNV-03)",{"$f":"Constants!$B83","v":0},null,null,null,{"$f":"SUMIF($O$14:$O$103,P166,$H$14:$H$103)","v":0},{"$f":"(Constants!$B$2*($G$7*$D84+$G$8*$E84+$C84*$G$6)*3630+$F84)*$B84/100","v":0},{"$f":"(Constants!$B$2*($G$7*$D84+$G$8*$E84+$C84*$G$6)*3630+$F84)*(1-$B84/100)","v":0},{"$f":"+$G84+$H84","v":0},{"$f":"Constants!C83","v":40},{"$f":"SUMIF($O$13:$O$103,P166,$N$13:$N$103)","v":0},{"$f":"(D84*$H$7)+(C84*$H$6)+(E84*$H$8)","v":0},{"$f":"IFERROR(($K84+$L84)*($G84+$H84*$J84/100)/$I84,0)","v":0},{"$f":"$K84+$L84-$M84","v":0},null,null,null,{"$f":"Constants!$D83","v":35},{"$f":"SUMIF($O$14:$O$103,$P166,$V$14:$V$103)","v":0},{"$f":"(D84*$R$7)+(C84*$R$6)+(E84*$R$8)","v":0},{"$f":"IFERROR(($S84+$T84)*($G84+$H84*$R84/100)/$I84,0)","v":0},{"$f":"$S84+$T84-$U84","v":0}]
[]
["13.  Filtering Practices (no RR)",null,null,null,null,null,null,null,null,null,null,null,null,null,null,null,null,"13.  Filtering Practices (no RR)"]
["13.a.Filtering Practice #1 (P-FIL-06)",{"$f":"Constants!$B86","v":0},null,null,null,{"$f":"SUMIF($O$14:$O$103,P167,$H$14:$H$103)","v":0},{"$f":"(Constants!$B$2*($G$7*$D87+$G$8*$E87+$C87*$G$6)*3630+$F87)*$B87/100","v":0},{"$f":"(Constants!$B$2*($G$7*$D87+$G$8*$E87+$C87*$G$6)*3630+$F87)*(1-$B87/100)","v":0},{"$f":"+$G87+$H87","v":0},{"$f":"Constants!C86","v":60},{"$f":"SUMIF($O$13:$O$103,P167,$N$13:$N$103)","v":0},{"$f":"(D87*$H$7)+(C87*$H$6)+(E87*$H$8)","v":0},{"$f":"IFERROR(($K87+$L87)*($G87+$H87*$J87/100)/$I87,0)","v":0},{"$f":"$K87+$L87-$M87","v":0},null,null,null,{"$f":"Constants!$D86","v":30},{"$f":"SUMIF($O$14:$O$103,$P167,$V$14:$V$103)","v":0},{"$f":"(D87*$R$7)+(C87*$R$6)+(E87*$R$8)","v":0},{"$f":"IFERROR(($S87+$T87)*($G87+$H87*$R87/100)/$I87,0)","v":0},{"$f":"$S87+$T87-$U87","v":0}]
["13.b. Filtering Practice #2 (P-FIL-06)",{"$f":"Constants!$B87","v":0},null,null,null,{"$f":"SUMIF($O$14:$O$103,P168,$H$14:$H$103)","v":0},{"$f":"(Constants!$B$2*($G$7*$D88+$G$8*$E88+$C88*$G$6)*3630+$F88)*$B88/100","v":0},{"$f":"(Constants!$B$2*($G$7*$D88+$G$8*$E88+$C88*$G$6)*3630+$F88)*(1-$B88/100)","v":0},{"$f":"+$G88+$H88","v":0},{"$f":"Constants!C87","v":65},{"$f":"SUMIF($O$13:$O$103,P168,$N$13:$N$103)","v":0},{"$f":"(D88*$H$7)+(C88*$H$6)+(E88*$H$8)","v":0},{"$f":"IFERROR(($K88+$L88)*($G88+$H88*$J88/100)/$I88,0)","v":0},{"$f":"$K88+$L88-$M88","v":0},null,null,null,{"$f":"Constants!$D87","v":45},{"$f":"SUMIF($O$14:$O$103,$P168,$V$14:$V$103)","v":0},{"$f":"(D88*$R$7)+(C88*$R$6)+(E88*$R$8)","v":0},{"$f":"IFERROR(($S88+$T88)*($G88+$H88*$R88/100)/$I88,0)","v":0},{"$f":"$S88+$T88-$U88","v":0}]
[]
["14. Constructed Wetland (no RR)",null,null,null,null,null,null,null,null,null,null,null,null,null,null,null,null,"14. Constructed Wetland (no RR)"]
["14.a.Constructed Wetland #1 (P-BAS-01)",{"$f":"Constants!$B90","v":0},null,null,null,{"$f":"SUMIF($O$14:$O$103,P169,$H$14:$H$103)","v":0},{"$f":"(Constants!$B$2*($G$7*$D91+$G$8*$E91+$C91*$G$6)*3630+$F91)*$B91/100","v":0},{"$f":"(Constants!$B$2*($G$7*$D91+$G$8*$E91+$C91*$G$6)*3630+$F91)*(1-$B91/100)","v":0},{"$f":"+$G91+$H91","v":0},{"$f":"Constants!C90","v":50},{"$f":"SUMIF($O$13:$O$103,P169,$N$13:$N$103)","v":0},{"$f":"(D91*$H$7)+(C91*$H$6)+(E91*$H$8)","v":0},{"$f":"IFERROR(($K91+$L91)*($G91+$H91*$J91/100)/$I91,0)","v":0},{"$f":"$K91+$L91-$M91","v":0},null,null,null,{"$f":"Constants!$D90","v":25},{"$f":"SUMIF($O$14:$O$103,$P169,$V$14:$V$103)","v":0},{"$f":"(D91*$R$7)+(C91*$R$6)+(E91*$R$8)","v":0},{"$f":"IFERROR(($S91+$T91)*($G91+$H91*$R91/100)/$I91,0)","v":0},{"$f":"$S91+$T91-$U91","v":0}]
["14.b. Constructed Wetland #2 (P-BAS-01)",{"$f":"Constants!$B91","v":0},null,null,null,{"$f":"SUMIF($O$14:$O$103,P170,$H$14:$H$103)","v":0},{"$f":"(Constants!$B$2*($G$7*$D92+$G$8*$E92+$C92*$G$6)*3630+$F92)*$B92/100","v":0},{"$f":"(Constants!$B$2*($G$7*$D92+$G$8*$E92+$C92*$G$6)*3630+$F92)*(1-$B92/100)","v":0},{"$f":"+$G92+$H92","v":0},{"$f":"Constants!C91","v":75},{"$f":"SUMIF($O$13:$O$103,P170,$N$13:$N$103)","v":0},{"$f":"(D92*$H$7)+(C92*$H$6)+(E92*$H$8)","v":0},{"$f":"IFERROR(($K92+$L92)*($G92+$H92*$J92/100)/$I92,0)","v":0},{"$f":"$K92+$L92-$M92","v":0},null,null,null,{"$f":"Constants!$D91","v":55},{"$f":"SUMIF($O$14:$O$103,$P170,$V$14:$V$103)","v":0},{"$f":"(D92*$R$7)+(C92*$R$6)+(E92*$R$8)","v":0},{"$f":"IFERROR(($S92+$T92)*($G92+$H92*$R92/100)/$I92,0)","v":0},{"$f":"$S92+$T92-$U92","v":0}]
[]
["15. Wet Ponds (no RR)",null,null,null,null,null,null,null,null,null,null,null,null,null,null,null,null,"15. Wet Ponds (no RR)"]
["15.a. Wet Pond #1 (P-BAS-02)",{"$f":"Constants!$B94","v":0},null,null,null,{"$f":"SUMIF($O$14:$O$103,P171,$H$14:$H$103)","v":0},{"$f":"(Constants!$B$2*($G$7*$D95+$G$8*$E95+$C95*$G$6)*3630+$F95)*$B95/100","v":0},{"$f":"(Constants!$B$2*($G$7*$D95+$G$8*$E95+$C95*$G$6)*3630+$F95)*(1-$B95/100)","v":0},{"$f":"+$G95+$H95","v":0},{"$f":"Constants!C94","v":50},{"$f":"SUMIF($O$13:$O$103,P171,$N$13:$N$103)","v":0},{"$f":"(D95*$H$7)+(C95*$H$6)+(E95*$H$8)","v":0},{"$f":"IFERROR(($K95+$L95)*($G95+$H95*$J95/100)/$I95,0)","v":0},{"$f":"$K95+$L95-$M95","v":0},null,null,null,{"$f":"Constants!$D94","v":30},{"$f":"SUMIF($O$14:$O$103,$P171,$V$14:$V$103)","v":0},{"$f":"(D95*$R$7)+(C95*$R$6)+(E95*$R$8)","v":0},{"$f":"IFERROR(($S95+$T95)*($G95+$H95*$R95/100)/$I95,0)","v":0},{"$f":"$S95+$T95-$U95","v":0}]
["15.b. Wet Pond #1 (Coastal Plain) (P-BAS-02)",{"$f":"Constants!$B95","v":0},null,null,null,{"$f":"SUMIF($O$14:$O$103,P172,$H$14:$H$103)","v":0},{"$f":"(Constants!$B$2*($G$7*$D96+$G$8*$E96+$C96*$G$6)*3630+$F96)*$B96/100","v":0},{"$f":"(Constants!$B$2*($G$7*$D96+$G$8*$E96+$C96*$G$6)*3630+$F96)*(1-$B96/100)","v":0},{"$f":"+$G96+$H96","v":0},{"$f":"Constants!C95","v":45},{"$f":"SUMIF($O$13:$O$103,P172,$N$13:$N$103)","v":0},{"$f":"(D96*$H$7)+(C96*$H$6)+(E96*$H$8)","v":0},{"$f":"IFERROR(($K96+$L96)*($G96+$H96*$J96/100)/$I96,0)","v":0},{"$f":"$K96+$L96-$M96","v":0},null,null,null,{"$f":"Constants!$D95","v":20},{"$f":"SUMIF($O$14:$O$103,$P172,$V$14:$V$103)","v":0},{"$f":"(D96*$R$7)+(C96*$R$6)+(E96*$R$8)","v":0},{"$f":"IFERROR(($S96+$T96)*($G96+$H96*$R96/100)/$I96,0)","v":0},{"$f":"$S96+$T96-$U96","v":0}]
["15.c. Wet Pond #2 (P-BAS-02)",{"$f":"Constants!$B96","v":0},null,null,null,{"$f":"SUMIF($O$14:$O$103,P173,$H$14:$H$103)","v":0},{"$f":"(Constants!$B$2*($G$7*$D97+$G$8*$E97+$C97*$G$6)*3630+$F97)*$B97/100","v":0},{"$f":"(Constants!$B$2*($G$7*$D97+$G$8*$E97+$C97*$G$6)*3630+$F97)*(1-$B97/100)","v":0},{"$f":"+$G97+$H97","v":0},{"$f":"Constants!C96","v":75},{"$f":"SUMIF($O$13:$O$103,P173,$N$13:$N$103)","v":0},{"$f":"(D97*$H$7)+(C97*$H$6)+(E97*$H$8)","v":0},{"$f":"IFERROR(($K97+$L97)*($G97+$H97*$J97/100)/$I97,0)","v":0},{"$f":"$K97+$L97-$M97","v":0},null,null,null,{"$f":"Constants!$D96","v":40},{"$f":"SUMIF($O$14:$O$103,$P173,$V$14:$V$103)","v":0},{"$f":"(D97*$R$7)+(C97*$R$6)+(E97*$R$8)","v":0},{"$f":"IFERROR(($S97+$T97)*($G97+$H97*$R97/100)/$I97,0)","v":0},{"$f":"$S97+$T97-$U97","v":0}]
["15.d. Wet Pond #2 (Coastal Plain) (P-BAS-02)",{"$f":"Constants!$B97","v":0},null,null,null,{"$f":"SUMIF($O$14:$O$103,P174,$H$14:$H$103)","v":0},{"$f":"(Constants!$B$2*($G$7*$D98+$G$8*$E98+$C98*$G$6)*3630+$F98)*$B98/100","v":0},{"$f":"(Constants!$B$2*($G$7*$D98+$G$8*$E98+$C98*$G$6)*3630+$F98)*(1-$B98/100)","v":0},{"$f":"+$G98+$H98","v":0},{"$f":"Constants!C97","v":65},{"$f":"SUMIF($O$13:$O$103,P174,$N$13:$N$103)","v":0},{"$f":"(D98*$H$7)+(C98*$H$6)+(E98*$H$8)","v":0},{"$f":"IFERROR(($K98+$L98)*($G98+$H98*$J98/100)/$I98,0)","v":0},{"$f":"$K98+$L98-$M98","v":0},null,null,null,{"$f":"Constants!$D97","v":30},{"$f":"SUMIF($O$14:$O$103,$P174,$V$14:$V$103)","v":0},{"$f":"(D98*$R$7)+(C98*$R$6)+(E98*$R$8)","v":0},{"$f":"IFERROR(($S98+$T98)*($G98+$H98*$R98/100)/$I98,0)","v":0},{"$f":"$S98+$T98-$U98","v":0}]
[]
["16. Manufactured Treatment Devices (no RR)",null,null,null,null,null,null,null,null,null,null,null,null,null,null,null,null,"16. Manufactured BMP (no RR)"]
["16.a. Manufactured Treatment Device-Hydrodynamic",{"$f":"Constants!$B100","v":0},null,null,null,{"$f":"SUMIF($O$14:$O$103,P175,$H$14:$H$103)","v":0},{"$f":"(Constants!$B$2*($G$7*$D101+$G$8*$E101+$C101*$G$6)*3630+$F101)*$B101/100","v":0},{"$f":"(Constants!$B$2*($G$7*$D101+$G$8*$E101+$C101*$G$6)*3630+$F101)*(1-$B101/100)","v":0},{"$f":"+$G101+$H101","v":0},20,{"$f":"SUMIF($O$13:$O$103,P175,$N$13:$N$103)","v":0},{"$f":"(D101*$H$7)+(C101*$H$6)+(E101*$H$8)","v":0},{"$f":"IFERROR(($K101+$L101)*($G101+$H101*$J101/100)/$I101,0)","v":0},{"$f":"$K101+$L101-$M101","v":0},null,null,null,0,{"$f":"SUMIF($O$14:$O$103,$P175,$V$14:$V$103)","v":0},{"$f":"(D101*$R$7)+(C101*$R$6)+(E101*$R$8)","v":0},{"$f":"IFERROR(($S101+$T101)*($G101+$H101*$R101/100)/$I101,0)","v":0},{"$f":"$S101+$T101-$U101","v":0}]
["16.b. Manufactured Treatment Device-Filtering",{"$f":"Constants!$B101","v":0},null,null,null,{"$f":"SUMIF($O$14:$O$103,P176,$H$14:$H$103)","v":0},{"$f":"(Constants!$B$2*($G$7*$D102+$G$8*$E102+$C102*$G$6)*3630+$F102)*$B102/100","v":0},{"$f":"(Constants!$B$2*($G$7*$D102+$G$8*$E102+$C102*$G$6)*3630+$F102)*(1-$B102/100)","v":0},{"$f":"+$G102+$H102","v":0},20,{"$f":"SUMIF($O$13:$O$103,P176,$N$13:$N$103)","v":0},{"$f":"(D102*$H$7)+(C102*$H$6)+(E102*$H$8)","v":0},{"$f":"IFERROR(($K102+$L102)*($G102+$H102*$J102/100)/$I102,0)","v":0},{"$f":"$K102+$L102-$M102","v":0},null,null,null,0,{"$f":"SUMIF($O$14:$O$103,$P176,$V$14:$V$103)","v":0},{"$f":"(D102*$R$7)+(C102*$R$6)+(E102*$R$8)","v":0},{"$f":"IFERROR(($S102+$T102)*($G102+$H102*$R102/100)/$I102,0)","v":0},{"$f":"$S102+$T102-$U102","v":0}]
["16.c. Manufactured Treatment Device-Generic",{"$f":"Constants!$B102","v":0},null,null,null,{"$f":"SUMIF($O$14:$O$103,P177,$H$14:$H$103)","v":0},{"$f":"(Constants!$B$2*($G$7*$D103+$G$8*$E103+$C103*$G$6)*3630+$F103)*$B103/100","v":0},{"$f":"(Constants!$B$2*($G$7*$D103+$G$8*$E103+$C103*$G$6)*3630+$F103)*(1-$B103/100)","v":0},{"$f":"+$G103+$H103","v":0},20,{"$f":"SUMIF($O$13:$O$103,P177,$N$13:$N$103)","v":0},{"$f":"(D103*$H$7)+(C103*$H$6)+(E103*$H$8)","v":0},{"$f":"IFERROR(($K103+$L103)*($G103+$H103*$J103/100)/$I103,0)","v":0},{"$f":"$K103+$L103-$M103","v":0},null,null,null,0,{"$f":"SUMIF($O$14:$O$103,$P177,$V$14:$V$103)","v":0},{"$f":"(D103*$R$7)+(C103*$R$6)+(E103*$R$8)","v":0},{"$f":"IFERROR(($S103+$T103)*($G103+$H103*$R103/100)/$I103,0)","v":0},{"$f":"$S103+$T103-$U103","v":0}]
[]
[]
[]
[null,null,null,null,"TOTAL IMPERVIOUS COVER TREATED (ac)",{"$f":"SUM($E$14:$E$103)","v":0},"AREA CHECK:",{"$f":"IF($F$107>$F$8,\"AREA EXCEEDED!\",\"OK.\")","v":"OK."}]
[null,null,null,null,"TOTAL MIXED OPEN TREATED (ac)",{"$f":"SUM($C$14:$C$103)","v":0},"AREA CHECK:",{"$f":"IF($F$108>$F$6,\"AREA EXCEEDED!\",\"OK.\")","v":"OK."}]
[null,null,null,null,"TOTAL MANAGED TURF AREA TREATED (ac)",{"$f":"SUM($D$14:$D$103)","v":0},"AREA CHECK:",{"$f":"IF($F$109>$F$7,\"AREA EXCEEDED!\",\"OK.\")","v":"OK."}]
[]
[null,null,null,null,null,null,null,"TOTAL PHOSPHORUS REMOVAL REQUIRED ON SITE (lb/yr)",{"$f":"IF(Site!$E$21=\"Check Areas!\",\"ERROR - \",Site!$E$21)","v":0},{"$f":"IF(I111=\"ERROR - \",\"Site Data Tab\",\"\")","v":""}]
[]
[null,null,null,null,null,null,null,"TOTAL PHOSPHORUS AVAILABLE FOR REMOVAL IN D.A. A (lb/yr)",{"$f":"$N$8","v":0}]
[null,null,null,null,null,null,null,"TOTAL PHOSPHORUS REMOVED WITHOUT RUNOFF REDUCTION PRACTICES IN D.A. A (lb/yr)",{"$f":"SUM($M$83:$M$103)","v":0}]
[null,null,null,null,null,null,null,"TOTAL PHOSPHORUS REMOVED WITH RUNOFF REDUCTION PRACTICES IN D.A. A (lb/yr)",{"$f":"$I$74","v":0}]
[null,null,null,null,null,null,null,"TOTAL PHOSPHORUS LOAD REDUCTION ACHIEVED IN D.A. A (lb/yr)",{"$f":"$I$114+$I$115","v":0}]
[null,null,null,null,null,null,null,"TOTAL PHOSPHORUS REMAINING AFTER APPLYING BMP LOAD REDUCTIONS IN D.A. A (lb/yr)",{"$f":"$I$113-$I$116","v":0}]
[]
[null,null,"SEE WATER QUALITY COMPLIANCE TAB FOR SITE COMPLIANCE CALCULATIONS"]
[]
[null,null,null,null,null,null,null,"NITROGEN REMOVED WITH RUNOFF REDUCTION PRACTICES IN D.A. A (lb/yr)",{"$f":"IFERROR(SUM($U$14:$U$65),0)","v":0}]
[null,null,null,null,null,null,null,"NITROGEN REMOVED WITHOUT RUNOFF REDUCTION PRACTICES IN D.A. A (lb/yr)",{"$f":"SUM($U$83:$U$103)","v":0}]
[null,null,null,null,null,null,null,"TOTAL NITROGEN REMOVED IN D.A. A (lb/yr)",{"$f":"$I$121+$I$122","v":0}]
[]
[]
[]
[]
[]
[]
[]
[null,null,"Downstream Practices - Dropdown selections for each applicable BMP"]
[]
["Options for 1. Green Roof",null,"Options for 2. Impervious Surface Disconnection",null,"Options for 3a. Pervious Parking, A/B Soils",null,"Options for 4a. Grass Channels, A/B Soils",null,null,"Options for 4b. Grass Channels, C/D Soils"]
[null,null,null,null,null,null,null,null,null,null,null,"Options for 4.c. Grass Channel Compost Amended Soils",null,null,null,"Master Downstream BMP Reference List"]
[{"$f":"P135","v":"None"},null,{"$f":"P135","v":"None"},null,{"$f":"P135","v":"None"},null,{"$f":"P135","v":"None"},null,null,{"$f":"P135","v":"None"},null,null,null,null,null,"None"]
["2.a. Simple Disconnection to A/B Soils",null,{"$f":"P146","v":"4.a. Grass Channel A/B Soils"},null,{"$f":"P146","v":"4.a. Grass Channel A/B Soils"},null,{"$f":"P147","v":"4.b. Grass Channel C/D Soils"},null,null,{"$f":"P146","v":"4.a. Grass Channel A/B Soils"},null,{"$f":"P135","v":"None"},null,null,null,"2.a. Simple Disconnection to A/B Soils"]
["2.b. Simple Disconnection to C/D Soils",null,"4.b. Grass Channel C/D Soils",null,"4.b. Grass Channel C/D Soils",null,"4.c. Grass Channel Compost Amended Soils",null,null,{"$f":"P148","v":"4.c. Grass Channel Compost Amended Soils"},null,{"$f":"P146","v":"4.a. Grass Channel A/B Soils"},null,null,null,"2.b. Simple Disconnection to C/D Soils"]
["2.c. To Soil Amended Filter Path",null,"4.c. Grass Channel Compost Amended Soils",null,"4.c. Grass Channel Compost Amended Soils",null,"5.a. Dry Swale #1",null,null,"5.a. Dry Swale #1",null,{"$f":"P147","v":"4.b. Grass Channel C/D Soils"},null,null,null,"2.c. To Soil Amended Filter Path"]
["2.d. To Dry Well/French Drain #1 (Micro-Infiltration #1)",null,"5.a. Dry Swale #1",null,"5.a. Dry Swale #1",null,"5.b. Dry Swale #2",null,null,"5.b. Dry Swale #2",null,{"$f":"P149","v":"5.a. Dry Swale #1"},null,null,null,"2.d. To Dry Well/French Drain #1 (Micro-Infiltration #1)"]
["2.e. To Dry Well/French Drain #2 (Micro-Infiltration. #2)",null,"5.b. Dry Swale #2",null,"5.b. Dry Swale #2",null,"6.a. Bioretention #1",null,null,"6.a. Bioretention #1",null,"5.b. Dry Swale #2",null,null,null,"2.e. To Dry Well/French Drain #2 (Micro-Infiltration. #2)"]
["2.f. To Rain Garden #1 (Micro-Bioretention #1)",null,"6.a. Bioretention #1",null,"6.a. Bioretention #1",null,"6.b. Bioretention #2",null,null,"6.b. Bioretention #2",null,"6.a. Bioretention #1",null,null,null,"2.f. To Rain Garden #1 (Micro-Bioretention #1)"]
["2.g. To Rain Garden #2 (Micro-Bioretention #2)",null,"6.b. Bioretention #2",null,"6.b. Bioretention #2",null,"7.a. Infiltration #1",null,null,"7.a. Infiltration #1",null,"6.b. Bioretention #2",null,null,null,"2.g. To Rain Garden #2 (Micro-Bioretention #2)"]
["2.h. To Train Barrel, Rain Tank, or Cistern",null,"7.a. Infiltration #1",null,"7.a. Infiltration #1",null,"7.b. Infiltration #2",null,null,"7.b. Infiltration #2",null,"7.a. Infiltration #1",null,null,null,"2.h. To Train Barrel, Rain Tank, or Cistern"]
["2.i. To Stormwater Planter (Urban Bioretention)",null,"7.b. Infiltration #2",null,"7.b. Infiltration #2",null,"8.a. ED #1",null,null,"8.a. ED #1",null,"7.b. Infiltration #2",null,null,null,"2.i. To Stormwater Planter (Urban Bioretention)"]
["3.a. Permeable Pavement #1",null,"8.a. ED #1",null,"8.a. ED #1",null,"8.b. ED #2",null,null,"8.b. ED #2",null,"8.a. ED #1",null,null,null,"3.a. Permeable Pavement #1"]
["4.a. Grass Channel A/B Soils",null,"8.b. ED #2",null,"8.b. ED #2",null,"9.a. Sheetflow to A/B Soil Conservation Area ",null,null,"9.a. Sheetflow to A/B Soil Conservation Area ",null,"8.b. ED #2",null,null,null,"4.a. Grass Channel A/B Soils"]
["4.b. Grass Channel C/D Soils",null,"9.a. Sheetflow to A/B Soil Conservation Area ",null,"9.a. Sheetflow to A/B Soil Conservation Area ",null,"9.b. Sheetflow to C/D Soil Conservation Area",null,null,"9.b. Sheetflow to C/D Soil Conservation Area",null,"9.a. Sheetflow to A/B Soil Conservation Area ",null,null,null,"4.b. Grass Channel C/D Soils"]
["4.c. Grass Channel Compost Amended Soils",null,"9.b. Sheetflow to C/D Soil Conservation Area",null,"9.b. Sheetflow to C/D Soil Conservation Area",null,"9.c. Sheetflow to Vegetated Filter Strip",null,null,"9.c. Sheetflow to Vegetated Filter Strip",null,"9.b. Sheetflow to C/D Soil Conservation Area",null,null,null,"4.c. Grass Channel Compost Amended Soils"]
["5.a. Dry Swale #1",null,"9.c. Sheetflow to Vegetated Filter Strip",null,"9.c. Sheetflow to Vegetated Filter Strip",null,"10.a. Regenerative Stormwater Conveyance #1",null,null,"10.a. Regenerative Stormwater Conveyance #1",null,"9.c. Sheetflow to Vegetated Filter Strip",null,null,null,"5.a. Dry Swale #1"]
["5.b. Dry Swale #2",null,"10.a. Regenerative Stormwater Conveyance #1",null,"10.a. Regenerative Stormwater Conveyance #1",null,"10.b. Regenerative Stormwater Conveyance #2",null,null,"10.b. Regenerative Stormwater Conveyance #2",null,"10.a. Regenerative Stormwater Conveyance #1",null,null,null,"5.b. Dry Swale #2"]
["6.a. Bioretention #1",null,"10.b. Regenerative Stormwater Conveyance #2",null,"10.b. Regenerative Stormwater Conveyance #2",null,{"$f":"P165","v":"12.a. Wet Swale #1"},null,null,{"$f":"P165","v":"12.a. Wet Swale #1"},null,"10.b. Regenerative Stormwater Conveyance #2",null,null,null,"6.a. Bioretention #1"]
["6.b. Bioretention #2",null,{"$f":"P165","v":"12.a. Wet Swale #1"},null,{"$f":"P165","v":"12.a. Wet Swale #1"},null,"12.b. Wet Swale #2",null,null,"12.b. Wet Swale #2",null,{"$f":"P165","v":"12.a. Wet Swale #1"},null,null,null,"6.b. Bioretention #2"]
["7.a. Infiltration #1",null,"12.b. Wet Swale #2",null,"12.b. Wet Swale #2",null,"13.a. Filtering Practice #1",null,null,"13.a. Filtering Practice #1",null,"12.b. Wet Swale #2",null,null,null,"7.a. Infiltration #1"]
["7.b. Infiltration #2",null,"13.a. Filtering Practice #1",null,"13.a. Filtering Practice #1",null,"13.b. Filtering Practice #2",null,null,"13.b. Filtering Practice #2",null,"13.a. Filtering Practice #1",null,null,null,"7.b. Infiltration #2"]
["8.a. ED #1",null,"13.b. Filtering Practice #2",null,"13.b. Filtering Practice #2",null,"14.a. Constructed Wetland #1",null,null,"14.a. Constructed Wetland #1",null,"13.b. Filtering Practice #2",null,null,null,"8.a. ED #1"]
["8.b. ED #2",null,"14.a. Constructed Wetland #1",null,"14.a. Constructed Wetland #1",null,"14.b. Constructed Wetland #2",null,null,"14.b. Constructed Wetland #2",null,"14.a. Constructed Wetland #1",null,null,null,"8.b. ED #2"]
["9.a. Sheetflow to A/B Soil Conservation Area ",null,"14.b. Constructed Wetland #2",null,"14.b. Constructed Wetland #2",null,"15.a. Wet Pond #1",null,null,"15.a. Wet Pond #1",null,"14.b. Constructed Wetland #2",null,null,null,"9.a. Sheetflow to A/B Soil Conservation Area "]
["9.b. Sheetflow to C/D Soil Conservation Area",null,"15.a. Wet Pond #1",null,"15.a. Wet Pond #1",null,"15.b. Wet Pond #1 (Coastal Plain)",null,null,"15.b. Wet Pond #1 (Coastal Plain)",null,"15.a. Wet Pond #1",null,null,null,"9.b. Sheetflow to C/D Soil Conservation Area"]
["9.c. Sheetflow to Vegetated Filter Strip",null,"15.b. Wet Pond #1 (Coastal Plain)",null,"15.b. Wet Pond #1 (Coastal Plain)",null,"15.c. Wet Pond #2",null,null,"15.c. Wet Pond #2",null,"15.b. Wet Pond #1 (Coastal Plain)",null,null,null,"9.c. Sheetflow to Vegetated Filter Strip"]
["10.a. Regenerative Stormwater Conveyance #1",null,"15.c. Wet Pond #2",null,"15.c. Wet Pond #2",null,"15.d. Wet Pond #2 (Coastal Plain)",null,null,"15.d. Wet Pond #2 (Coastal Plain)",null,"15.c. Wet Pond #2",null,null,null,"10.a. Regenerative Stormwater Conveyance #1"]
["10.b. Regenerative Stormwater Conveyance #2",null,"15.d. Wet Pond #2 (Coastal Plain)",null,"15.d. Wet Pond #2 (Coastal Plain)",null,"16.a. MTD - Hydrodynamic",null,null,"16.a. MTD - Hydrodynamic",null,"15.d. Wet Pond #2 (Coastal Plain)",null,null,null,"10.b. Regenerative Stormwater Conveyance #2"]
[{"$f":"P165","v":"12.a. Wet Swale #1"},null,"16.a. MTD - Hydrodynamic",null,"16.a. MTD - Hydrodynamic",null,"16.b. MTD - Filtering",null,null,"16.b. MTD - Filtering",null,"16.a. MTD - Hydrodynamic",null,null,null,"11.a. Trees over Pervious, A/B"]
["12.b. Wet Swale #2",null,"16.b. MTD - Filtering",null,"16.b. MTD - Filtering",null,"16.c. MTD - Generic",null,null,"16.c. MTD - Generic",null,"16.b. MTD - Filtering",null,null,null,"11.b. Trees over Pervious, B/C"]
["13.a. Filtering Practice #1",null,"16.c. MTD - Generic",null,"16.c. MTD - Generic",null,null,null,null,null,null,"16.c. MTD - Generic",null,null,null,"11.c. Trees over Impervious"]
["13.b. Filtering Practice #2",null,null,null,null,null,null,null,null,null,null,null,null,null,null,"12.a. Wet Swale #1"]
["14.a. Constructed Wetland #1",null,null,null,null,null,null,null,null,null,null,null,null,null,null,"12.b. Wet Swale #2"]
["14.b. Constructed Wetland #2",null,null,null,null,null,null,null,null,null,null,null,null,null,null,"13.a. Filtering Practice #1"]
["15.a. Wet Pond #1",null,null,null,null,null,null,null,null,null,null,null,null,null,null,"13.b. Filtering Practice #2"]
["15.b. Wet Pond #1 (Coastal Plain)",null,null,null,null,null,null,null,null,null,null,null,null,null,null,"14.a. Constructed Wetland #1"]
["15.c. Wet Pond #2",null,null,null,null,null,null,null,null,null,null,null,null,null,null,"14.b. Constructed Wetland #2"]
["15.d. Wet Pond #2 (Coastal Plain)",null,null,null,null,null,null,null,null,null,null,null,null,null,null,"15.a. Wet Pond #1"]
["16.a. MTD - Hydrodynamic",null,null,null,null,null,null,null,null,null,null,null,null,null,null,"15.b. Wet Pond #1 (Coastal Plain)"]
["16.b. MTD - Filtering",null,null,null,null,null,null,null,null,null,null,null,null,null,null,"15.c. Wet Pond #2"]
["16.c. MTD - Generic",null,null,null,null,null,null,null,null,null,null,null,null,null,null,"15.d. Wet Pond #2 (Coastal Plain)"]
[null,null,null,null,null,null,null,null,null,null,null,null,null,null,null,"16.a. MTD - Hydrodynamic"]
["Options for 5a. Dry Swale #1",null,"Options for 5b. Dry Swale #2",null,"Options for 6a. Bioretention #1",null,"Options for 6b. Bioretention #2",null,null,"Options for 7a. Infiltration #1",null,"Options for 7b. Infiltration #2",null,null,null,"16.b. MTD - Filtering"]
[null,null,null,null,null,null,null,null,null,null,null,null,null,null,null,"16.c. MTD - Generic"]
[{"$f":"P135","v":"None"},null,{"$f":"P135","v":"None"},null,{"$f":"P135","v":"None"},null,{"$f":"P135","v":"None"},null,null,{"$f":"P135","v":"None"},null,{"$f":"P135","v":"None"}]
[{"$f":"P146","v":"4.a. Grass Channel A/B Soils"},null,{"$f":"P146","v":"4.a. Grass Channel A/B Soils"},null,{"$f":"P146","v":"4.a. Grass Channel A/B Soils"},null,{"$f":"P146","v":"4.a. Grass Channel A/B Soils"},null,null,{"$f":"P146","v":"4.a. Grass Channel A/B Soils"},null,{"$f":"P146","v":"4.a. Grass Channel A/B Soils"}]
[{"$f":"P147","v":"4.b. Grass Channel C/D Soils"},null,{"$f":"P147","v":"4.b. Grass Channel C/D Soils"},null,{"$f":"P147","v":"4.b. Grass Channel C/D Soils"},null,"4.b. Grass Channel C/D Soils",null,null,"4.b. Grass Channel C/D Soils",null,"4.b. Grass Channel C/D Soils"]
[{"$f":"P148","v":"4.c. Grass Channel Compost Amended Soils"},null,{"$f":"P148","v":"4.c. Grass Channel Compost Amended Soils"},null,{"$f":"P148","v":"4.c. Grass Channel Compost Amended Soils"},null,"4.c. Grass Channel Compost Amended Soils",null,null,"4.c. Grass Channel Compost Amended Soils",null,"4.c. Grass Channel Compost Amended Soils"]
[{"$f":"P150","v":"5.b. Dry Swale #2"},null,{"$f":"P149","v":"5.a. Dry Swale #1"},null,{"$f":"P149","v":"5.a. Dry Swale #1"},null,"5.a. Dry Swale #1",null,null,"5.a. Dry Swale #1",null,"5.a. Dry Swale #1"]
["6.a. Bioretention #1",null,{"$f":"P151","v":"6.a. Bioretention #1"},null,{"$f":"P150","v":"5.b. Dry Swale #2"},null,"5.b. Dry Swale #2",null,null,"5.b. Dry Swale #2",null,"5.b. Dry Swale #2"]
["6.b. Bioretention #2",null,"6.b. Bioretention #2",null,{"$f":"P152","v":"6.b. Bioretention #2"},null,"6.a. Bioretention #1",null,null,"6.a. Bioretention #1",null,"6.a. Bioretention #1"]
["7.a. Infiltration #1",null,"7.a. Infiltration #1",null,"7.a. Infiltration #1",null,{"$f":"P153","v":"7.a. Infiltration #1"},null,null,"6.b. Bioretention #2",null,"6.b. Bioretention #2"]
["7.b. Infiltration #2",null,"7.b. Infiltration #2",null,"7.b. Infiltration #2",null,"7.b. Infiltration #2",null,null,{"$f":"P154","v":"7.b. Infiltration #2"},null,"7.a. Infiltration #1"]
["8.a. ED #1",null,"8.a. ED #1",null,"8.a. ED #1",null,"8.a. ED #1",null,null,"8.a. ED #1",null,{"$f":"P155","v":"8.a. ED #1"}]
["8.b. ED #2",null,"8.b. ED #2",null,"8.b. ED #2",null,"8.b. ED #2",null,null,"8.b. ED #2",null,"8.b. ED #2"]
["9.a. Sheetflow to A/B Soil Conservation Area ",null,"9.a. Sheetflow to A/B Soil Conservation Area ",null,"9.a. Sheetflow to A/B Soil Conservation Area ",null,"9.a. Sheetflow to A/B Soil Conservation Area ",null,null,"9.a. Sheetflow to A/B Soil Conservation Area ",null,"9.a. Sheetflow to A/B Soil Conservation Area "]
["9.b. Sheetflow to C/D Soil Conservation Area",null,"9.b. Sheetflow to C/D Soil Conservation Area",null,"9.b. Sheetflow to C/D Soil Conservation Area",null,"9.b. Sheetflow to C/D Soil Conservation Area",null,null,"9.b. Sheetflow to C/D Soil Conservation Area",null,"9.b. Sheetflow to C/D Soil Conservation Area"]
["9.c. Sheetflow to Vegetated Filter Strip",null,"9.c. Sheetflow to Vegetated Filter Strip",null,"9.c. Sheetflow to Vegetated Filter Strip",null,"9.c. Sheetflow to Vegetated Filter Strip",null,null,"9.c. Sheetflow to Vegetated Filter Strip",null,"9.c. Sheetflow to Vegetated Filter Strip"]
["10.a. Regenerative Stormwater Conveyance #1",null,"10.a. Regenerative Stormwater Conveyance #1",null,"10.a. Regenerative Stormwater Conveyance #1",null,"10.a. Regenerative Stormwater Conveyance #1",null,null,"10.a. Regenerative Stormwater Conveyance #1",null,"10.a. Regenerative Stormwater Conveyance #1"]
["10.b. Regenerative Stormwater Conveyance #2",null,"10.b. Regenerative Stormwater Conveyance #2",null,"10.b. Regenerative Stormwater Conveyance #2",null,"10.b. Regenerative Stormwater Conveyance #2",null,null,"10.b. Regenerative Stormwater Conveyance #2",null,"10.b. Regenerative Stormwater Conveyance #2"]
[{"$f":"P165","v":"12.a. Wet Swale #1"},null,{"$f":"P165","v":"12.a. Wet Swale #1"},null,{"$f":"P165","v":"12.a. Wet Swale #1"},null,{"$f":"P165","v":"12.a. Wet Swale #1"},null,null,{"$f":"P165","v":"12.a. Wet Swale #1"},null,{"$f":"P165","v":"12.a. Wet Swale #1"}]
["12.b. Wet Swale #2",null,"12.b. Wet Swale #2",null,"12.b. Wet Swale #2",null,"12.b. Wet Swale #2",null,null,"12.b. Wet Swale #2",null,"12.b. Wet Swale #2"]
["13.a. Filtering Practice #1",null,"13.a. Filtering Practice #1",null,"13.a. Filtering Practice #1",null,"13.a. Filtering Practice #1",null,null,"13.a. Filtering Practice #1",null,"13.a. Filtering Practice #1"]
["13.b. Filtering Practice #2",null,"13.b. Filtering Practice #2",null,"13.b. Filtering Practice #2",null,"13.b. Filtering Practice #2",null,null,"13.b. Filtering Practice #2",null,"13.b. Filtering Practice #2"]
["14.a. Constructed Wetland #1",null,"14.a. Constructed Wetland #1",null,"14.a. Constructed Wetland #1",null,"14.a. Constructed Wetland #1",null,null,"14.a. Constructed Wetland #1",null,"14.a. Constructed Wetland #1"]
["14.b. Constructed Wetland #2",null,"14.b. Constructed Wetland #2",null,"14.b. Constructed Wetland #2",null,"14.b. Constructed Wetland #2",null,null,"14.b. Constructed Wetland #2",null,"14.b. Constructed Wetland #2"]
["15.a. Wet Pond #1",null,"15.a. Wet Pond #1",null,"15.a. Wet Pond #1",null,"15.a. Wet Pond #1",null,null,"15.a. Wet Pond #1",null,"15.a. Wet Pond #1"]
["15.b. Wet Pond #1 (Coastal Plain)",null,"15.b. Wet Pond #1 (Coastal Plain)",null,"15.b. Wet Pond #1 (Coastal Plain)",null,"15.b. Wet Pond #1 (Coastal Plain)",null,null,"15.b. Wet Pond #1 (Coastal Plain)",null,"15.b. Wet Pond #1 (Coastal Plain)"]
["15.c. Wet Pond #2",null,"15.c. Wet Pond #2",null,"15.c. Wet Pond #2",null,"15.c. Wet Pond #2",null,null,"15.c. Wet Pond #2",null,"15.c. Wet Pond #2"]
["15.d. Wet Pond #2 (Coastal Plain)",null,"15.d. Wet Pond #2 (Coastal Plain)",null,"15.d. Wet Pond #2 (Coastal Plain)",null,"15.d. Wet Pond #2 (Coastal Plain)",null,null,"15.d. Wet Pond #2 (Coastal Plain)",null,"15.d. Wet Pond #2 (Coastal Plain)"]
["16.a. MTD - Hydrodynamic",null,"16.a. MTD - Hydrodynamic",null,"16.a. MTD - Hydrodynamic",null,"16.a. MTD - Hydrodynamic",null,null,"16.a. MTD - Hydrodynamic",null,"16.a. MTD - Hydrodynamic"]
["16.b. MTD - Filtering",null,"16.b. MTD - Filtering",null,"16.b. MTD - Filtering",null,"16.b. MTD - Filtering",null,null,"16.b. MTD - Filtering",null,"16.b. MTD - Filtering"]
["16.c. MTD - Generic",null,"16.c. MTD - Generic",null,"16.c. MTD - Generic",null,"16.c. MTD - Generic",null,null,"16.c. MTD - Generic",null,"16.c. MTD - Generic"]
[]
["Options for 8a. Extended Detention #1",null,"Options for 8b. Extended Detention #2",null,"Options for 9 Sheet Flow to Open Space",null,"Options for 9c. Sheet Flow to Filter Strip",null,null,"Options for 10a. Wet Swale #1",null,"Options for 10b. Wet Swale #2"]
[]
[{"$f":"P135","v":"None"},null,{"$f":"P135","v":"None"},null,{"$f":"P135","v":"None"},null,{"$f":"P135","v":"None"},null,null,{"$f":"P135","v":"None"},null,{"$f":"P135","v":"None"}]
[{"$f":"P146","v":"4.a. Grass Channel A/B Soils"},null,{"$f":"P146","v":"4.a. Grass Channel A/B Soils"},null,null,null,{"$f":"P146","v":"4.a. Grass Channel A/B Soils"},null,null,{"$f":"P146","v":"4.a. Grass Channel A/B Soils"},null,{"$f":"P146","v":"4.a. Grass Channel A/B Soils"}]
["4.b. Grass Channel C/D Soils",null,"4.b. Grass Channel C/D Soils",null,null,null,"4.b. Grass Channel C/D Soils",null,null,"4.b. Grass Channel C/D Soils",null,"4.b. Grass Channel C/D Soils"]
["4.c. Grass Channel Compost Amended Soils",null,"4.c. Grass Channel Compost Amended Soils",null,null,null,"4.c. Grass Channel Compost Amended Soils",null,null,"4.c. Grass Channel Compost Amended Soils",null,"4.c. Grass Channel Compost Amended Soils"]
["5.a. Dry Swale #1",null,"5.a. Dry Swale #1",null,null,null,"5.a. Dry Swale #1",null,null,"5.a. Dry Swale #1",null,"5.a. Dry Swale #1"]
["5.b. Dry Swale #2",null,"5.b. Dry Swale #2",null,null,null,"5.b. Dry Swale #2",null,null,"5.b. Dry Swale #2",null,"5.b. Dry Swale #2"]
["6.a. Bioretention #1",null,"6.a. Bioretention #1",null,null,null,"6.a. Bioretention #1",null,null,"6.a. Bioretention #1",null,"6.a. Bioretention #1"]
["6.b. Bioretention #2",null,"6.b. Bioretention #2",null,null,null,"6.b. Bioretention #2",null,null,"6.b. Bioretention #2",null,"6.b. Bioretention #2"]
["7.a. Infiltration #1",null,"7.a. Infiltration #1",null,null,null,"7.a. Infiltration #1",null,null,"7.a. Infiltration #1",null,"7.a. Infiltration #1"]
["7.b. Infiltration #2",null,"7.b. Infiltration #2",null,null,null,"7.b. Infiltration #2",null,null,"7.b. Infiltration #2",null,"7.b. Infiltration #2"]
[{"$f":"P156","v":"8.b. ED #2"},null,"8.a. ED #1",null,null,null,"8.a. ED #1",null,null,"8.a. ED #1",null,"8.a. ED #1"]
["9.a. Sheetflow to A/B Soil Conservation Area ",null,{"$f":"P157","v":"9.a. Sheetflow to A/B Soil Conservation Area "},null,null,null,"8.b. ED #2",null,null,"8.b. ED #2",null,"8.b. ED #2"]
["9.b. Sheetflow to C/D Soil Conservation Area",null,"9.b. Sheetflow to C/D Soil Conservation Area",null,null,null,"9.a. Sheetflow to A/B Soil Conservation Area ",null,null,"9.a. Sheetflow to A/B Soil Conservation Area ",null,"9.a. Sheetflow to A/B Soil Conservation Area "]
["9.c. Sheetflow to Vegetated Filter Strip",null,"9.c. Sheetflow to Vegetated Filter Strip",null,null,null,"9.b. Sheetflow to C/D Soil Conservation Area",null,null,"9.b. Sheetflow to C/D Soil Conservation Area",null,"9.b. Sheetflow to C/D Soil Conservation Area"]
["10.a. Regenerative Stormwater Conveyance #1",null,"10.a. Regenerative Stormwater Conveyance #1",null,null,null,{"$f":"P160","v":"10.a. Regenerative Stormwater Conveyance #1"},null,null,"9.c. Sheetflow to Vegetated Filter Strip",null,"9.c. Sheetflow to Vegetated Filter Strip"]
["10.b. Regenerative Stormwater Conveyance #2",null,"10.b. Regenerative Stormwater Conveyance #2",null,null,null,{"$f":"P161","v":"10.b. Regenerative Stormwater Conveyance #2"},null,null,"10.a. Regenerative Stormwater Conveyance #1",null,"10.a. Regenerative Stormwater Conveyance #1"]
[{"$f":"P165","v":"12.a. Wet Swale #1"},null,{"$f":"P165","v":"12.a. Wet Swale #1"},null,null,null,{"$f":"P165","v":"12.a. Wet Swale #1"},null,null,"10.b. Regenerative Stormwater Conveyance #2",null,"10.b. Regenerative Stormwater Conveyance #2"]
["12.b. Wet Swale #2",null,"12.b. Wet Swale #2",null,null,null,"12.b. Wet Swale #2",null,null,{"$f":"P166","v":"12.b. Wet Swale #2"},null,{"$f":"P165","v":"12.a. Wet Swale #1"}]
["13.a. Filtering Practice #1",null,"13.a. Filtering Practice #1",null,null,null,"13.a. Filtering Practice #1",null,null,"13.a. Filtering Practice #1",null,{"$f":"P167","v":"13.a. Filtering Practice #1"}]
["13.b. Filtering Practice #2",null,"13.b. Filtering Practice #2",null,null,null,"13.b. Filtering Practice #2",null,null,"13.b. Filtering Practice #2",null,"13.b. Filtering Practice #2"]
["14.a. Constructed Wetland #1",null,"14.a. Constructed Wetland #1",null,null,null,"14.a. Constructed Wetland #1",null,null,"14.a. Constructed Wetland #1",null,"14.a. Constructed Wetland #1"]
["14.b. Constructed Wetland #2",null,"14.b. Constructed Wetland #2",null,null,null,"14.b. Constructed Wetland #2",null,null,"14.b. Constructed Wetland #2",null,"14.b. Constructed Wetland #2"]
["15.a. Wet Pond #1",null,"15.a. Wet Pond #1",null,null,null,"15.a. Wet Pond #1",null,null,"15.a. Wet Pond #1",null,"15.a. Wet Pond #1"]
["15.b. Wet Pond #1 (Coastal Plain)",null,"15.b. Wet Pond #1 (Coastal Plain)",null,null,null,"15.b. Wet Pond #1 (Coastal Plain)",null,null,"15.b. Wet Pond #1 (Coastal Plain)",null,"15.b. Wet Pond #1 (Coastal Plain)"]
["15.c. Wet Pond #2",null,"15.c. Wet Pond #2",null,null,null,"15.c. Wet Pond #2",null,null,"15.c. Wet Pond #2",null,"15.c. Wet Pond #2"]
["15.d. Wet Pond #2 (Coastal Plain)",null,"15.d. Wet Pond #2 (Coastal Plain)",null,null,null,"15.d. Wet Pond #2 (Coastal Plain)",null,null,"15.d. Wet Pond #2 (Coastal Plain)",null,"15.d. Wet Pond #2 (Coastal Plain)"]
["16.a. MTD - Hydrodynamic",null,"16.a. MTD - Hydrodynamic",null,null,null,"16.a. MTD - Hydrodynamic",null,null,"16.a. MTD - Hydrodynamic",null,"16.a. MTD - Hydrodynamic"]
["16.b. MTD - Filtering",null,"16.b. MTD - Filtering",null,null,null,"16.b. MTD - Filtering",null,null,"16.b. MTD - Filtering",null,"16.b. MTD - Filtering"]
["16.c. MTD - Generic",null,"16.c. MTD - Generic",null,null,null,"16.c. MTD - Generic",null,null,"16.c. MTD - Generic",null,"16.c. MTD - Generic"]
[]
[]
[]
["Options for 11 A.  Filtering Practice #1",null,"Options for 11 b.  Filtering Practice #2",null,"Options for 12.a.  Constructed Wetland #1",null,"Options for 12.b.  Constructed Wetland #2",null,null,"Options for 13.a.  Wet Pond #1",null,"Options for 13.b.  Wet Pond #1 (Coastal Plain)"]
[null,null,null,null,null,null,null,null,null,{"$f":"P135","v":"None"},null,{"$f":"P135","v":"None"}]
[{"$f":"P135","v":"None"},null,{"$f":"P135","v":"None"},null,{"$f":"P135","v":"None"},null,{"$f":"P135","v":"None"},null,null,{"$f":"P146","v":"4.a. Grass Channel A/B Soils"},null,{"$f":"P146","v":"4.a. Grass Channel A/B Soils"}]
[{"$f":"P146","v":"4.a. Grass Channel A/B Soils"},null,{"$f":"P146","v":"4.a. Grass Channel A/B Soils"},null,{"$f":"P146","v":"4.a. Grass Channel A/B Soils"},null,{"$f":"P146","v":"4.a. Grass Channel A/B Soils"},null,null,"4.b. Grass Channel C/D Soils",null,"4.b. Grass Channel C/D Soils"]
["4.b. Grass Channel C/D Soils",null,"4.b. Grass Channel C/D Soils",null,"4.b. Grass Channel C/D Soils",null,"4.b. Grass Channel C/D Soils",null,null,"4.c. Grass Channel Compost Amended Soils",null,"4.c. Grass Channel Compost Amended Soils"]
["4.c. Grass Channel Compost Amended Soils",null,"4.c. Grass Channel Compost Amended Soils",null,"4.c. Grass Channel Compost Amended Soils",null,"4.c. Grass Channel Compost Amended Soils",null,null,"5.a. Dry Swale #1",null,"5.a. Dry Swale #1"]
["5.a. Dry Swale #1",null,"5.a. Dry Swale #1",null,"5.a. Dry Swale #1",null,"5.a. Dry Swale #1",null,null,"5.b. Dry Swale #2",null,"5.b. Dry Swale #2"]
["5.b. Dry Swale #2",null,"5.b. Dry Swale #2",null,"5.b. Dry Swale #2",null,"5.b. Dry Swale #2",null,null,"6.a. Bioretention #1",null,"6.a. Bioretention #1"]
["6.a. Bioretention #1",null,"6.a. Bioretention #1",null,"6.a. Bioretention #1",null,"6.a. Bioretention #1",null,null,"6.b. Bioretention #2",null,"6.b. Bioretention #2"]
["6.b. Bioretention #2",null,"6.b. Bioretention #2",null,"6.b. Bioretention #2",null,"6.b. Bioretention #2",null,null,"7.a. Infiltration #1",null,"7.a. Infiltration #1"]
["7.a. Infiltration #1",null,"7.a. Infiltration #1",null,"7.a. Infiltration #1",null,"7.a. Infiltration #1",null,null,"7.b. Infiltration #2",null,"7.b. Infiltration #2"]
["7.b. Infiltration #2",null,"7.b. Infiltration #2",null,"7.b. Infiltration #2",null,"7.b. Infiltration #2",null,null,"8.a. ED #1",null,"8.a. ED #1"]
["8.a. ED #1",null,"8.a. ED #1",null,"8.a. ED #1",null,"8.a. ED #1",null,null,"8.b. ED #2",null,"8.b. ED #2"]
["8.b. ED #2",null,"8.b. ED #2",null,"8.b. ED #2",null,"8.b. ED #2",null,null,"9.a. Sheetflow to A/B Soil Conservation Area ",null,"9.a. Sheetflow to A/B Soil Conservation Area "]
["9.a. Sheetflow to A/B Soil Conservation Area ",null,"9.a. Sheetflow to A/B Soil Conservation Area ",null,"9.a. Sheetflow to A/B Soil Conservation Area ",null,"9.a. Sheetflow to A/B Soil Conservation Area ",null,null,"9.b. Sheetflow to C/D Soil Conservation Area",null,"9.b. Sheetflow to C/D Soil Conservation Area"]
["9.b. Sheetflow to C/D Soil Conservation Area",null,"9.b. Sheetflow to C/D Soil Conservation Area",null,"9.b. Sheetflow to C/D Soil Conservation Area",null,"9.b. Sheetflow to C/D Soil Conservation Area",null,null,"9.c. Sheetflow to Vegetated Filter Strip",null,"9.c. Sheetflow to Vegetated Filter Strip"]
["9.c. Sheetflow to Vegetated Filter Strip",null,"9.c. Sheetflow to Vegetated Filter Strip",null,"9.c. Sheetflow to Vegetated Filter Strip",null,"9.c. Sheetflow to Vegetated Filter Strip",null,null,"10.a. Regenerative Stormwater Conveyance #1",null,"10.a. Regenerative Stormwater Conveyance #1"]
[{"$f":"P165","v":"12.a. Wet Swale #1"},null,"10.a. Regenerative Stormwater Conveyance #1",null,"10.a. Regenerative Stormwater Conveyance #1",null,"10.a. Regenerative Stormwater Conveyance #1",null,null,"10.b. Regenerative Stormwater Conveyance #2",null,"10.b. Regenerative Stormwater Conveyance #2"]
[{"$f":"P166","v":"12.b. Wet Swale #2"},null,"10.b. Regenerative Stormwater Conveyance #2",null,"10.b. Regenerative Stormwater Conveyance #2",null,"10.b. Regenerative Stormwater Conveyance #2",null,null,{"$f":"P165","v":"12.a. Wet Swale #1"},null,{"$f":"P165","v":"12.a. Wet Swale #1"}]
[{"$f":"P168","v":"13.b. Filtering Practice #2"},null,{"$f":"P165","v":"12.a. Wet Swale #1"},null,{"$f":"P165","v":"12.a. Wet Swale #1"},null,{"$f":"P165","v":"12.a. Wet Swale #1"},null,null,"12.b. Wet Swale #2",null,"12.b. Wet Swale #2"]
["14.a. Constructed Wetland #1",null,{"$f":"P166","v":"12.b. Wet Swale #2"},null,{"$f":"P166","v":"12.b. Wet Swale #2"},null,{"$f":"P166","v":"12.b. Wet Swale #2"},null,null,"13.a. Filtering Practice #1",null,"13.a. Filtering Practice #1"]
["14.b. Constructed Wetland #2",null,{"$f":"P167","v":"13.a. Filtering Practice #1"},null,{"$f":"P167","v":"13.a. Filtering Practice #1"},null,{"$f":"P167","v":"13.a. Filtering Practice #1"},null,null,"13.b. Filtering Practice #2",null,"13.b. Filtering Practice #2"]
["15.a. Wet Pond #1",null,{"$f":"P169","v":"14.a. Constructed Wetland #1"},null,{"$f":"P168","v":"13.b. Filtering Practice #2"},null,{"$f":"P168","v":"13.b. Filtering Practice #2"},null,null,"14.a. Constructed Wetland #1",null,"14.a. Constructed Wetland #1"]
["15.b. Wet Pond #1 (Coastal Plain)",null,"14.b. Constructed Wetland #2",null,{"$f":"P170","v":"14.b. Constructed Wetland #2"},null,{"$f":"P169","v":"14.a. Constructed Wetland #1"},null,null,"14.b. Constructed Wetland #2",null,"14.b. Constructed Wetland #2"]
["15.c. Wet Pond #2",null,"15.a. Wet Pond #1",null,"15.a. Wet Pond #1",null,{"$f":"P171","v":"15.a. Wet Pond #1"},null,null,{"$f":"P173","v":"15.c. Wet Pond #2"},null,{"$f":"P174","v":"15.d. Wet Pond #2 (Coastal Plain)"}]
["15.d. Wet Pond #2 (Coastal Plain)",null,"15.b. Wet Pond #1 (Coastal Plain)",null,"15.b. Wet Pond #1 (Coastal Plain)",null,"15.b. Wet Pond #1 (Coastal Plain)",null,null,{"$f":"P175","v":"16.a. MTD - Hydrodynamic"},null,{"$f":"P175","v":"16.a. MTD - Hydrodynamic"}]
["16.a. MTD - Hydrodynamic",null,"15.c. Wet Pond #2",null,"15.c. Wet Pond #2",null,"15.c. Wet Pond #2",null,null,{"$f":"P176","v":"16.b. MTD - Filtering"},null,{"$f":"P176","v":"16.b. MTD - Filtering"}]
["16.b. MTD - Filtering",null,"15.d. Wet Pond #2 (Coastal Plain)",null,"15.d. Wet Pond #2 (Coastal Plain)",null,"15.d. Wet Pond #2 (Coastal Plain)",null,null,{"$f":"P177","v":"16.c. MTD - Generic"},null,{"$f":"P177","v":"16.c. MTD - Generic"}]
["16.c. MTD - Generic",null,"16.a. MTD - Hydrodynamic",null,"16.a. MTD - Hydrodynamic",null,"16.a. MTD - Hydrodynamic"]
[null,null,"16.b. MTD - Filtering",null,"16.b. MTD - Filtering",null,"16.b. MTD - Filtering"]
[null,null,"16.c. MTD - Generic",null,"16.c. MTD - Generic",null,"16.c. MTD - Generic"]
[]
[]
[]
["Options for 13.c.  Wet Pond #2",null,"Options for 13.d.  Wet Pond #2 (Coastal Plain)",null,"Options for 14.a.  Manufactured Device-Hydrodynamic",null,"Options for 14.b.  Manufactured Device-Filtering",null,null,null,"Options for 14.c.  Manufactured Device-Generic"]
[]
[{"$f":"P135","v":"None"},null,{"$f":"P135","v":"None"},null,{"$f":"P135","v":"None"},null,{"$f":"P135","v":"None"},null,null,null,{"$f":"P135","v":"None"}]
[{"$f":"P146","v":"4.a. Grass Channel A/B Soils"},null,{"$f":"P146","v":"4.a. Grass Channel A/B Soils"},null,{"$f":"P146","v":"4.a. Grass Channel A/B Soils"},null,{"$f":"P146","v":"4.a. Grass Channel A/B Soils"},null,null,null,{"$f":"P146","v":"4.a. Grass Channel A/B Soils"}]
["4.b. Grass Channel C/D Soils",null,"4.b. Grass Channel C/D Soils",null,"4.b. Grass Channel C/D Soils",null,"4.b. Grass Channel C/D Soils",null,null,null,"4.b. Grass Channel C/D Soils"]
["4.c. Grass Channel Compost Amended Soils",null,"4.c. Grass Channel Compost Amended Soils",null,"4.c. Grass Channel Compost Amended Soils",null,"4.c. Grass Channel Compost Amended Soils",null,null,null,"4.c. Grass Channel Compost Amended Soils"]
["5.a. Dry Swale #1",null,"5.a. Dry Swale #1",null,"5.a. Dry Swale #1",null,"5.a. Dry Swale #1",null,null,null,"5.a. Dry Swale #1"]
["5.b. Dry Swale #2",null,"5.b. Dry Swale #2",null,"5.b. Dry Swale #2",null,"5.b. Dry Swale #2",null,null,null,"5.b. Dry Swale #2"]
["6.a. Bioretention #1",null,"6.a. Bioretention #1",null,"6.a. Bioretention #1",null,"6.a. Bioretention #1",null,null,null,"6.a. Bioretention #1"]
["6.b. Bioretention #2",null,"6.b. Bioretention #2",null,"6.b. Bioretention #2",null,"6.b. Bioretention #2",null,null,null,"6.b. Bioretention #2"]
["7.a. Infiltration #1",null,"7.a. Infiltration #1",null,"7.a. Infiltration #1",null,"7.a. Infiltration #1",null,null,null,"7.a. Infiltration #1"]
["7.b. Infiltration #2",null,"7.b. Infiltration #2",null,"7.b. Infiltration #2",null,"7.b. Infiltration #2",null,null,null,"7.b. Infiltration #2"]
["8.a. ED #1",null,"8.a. ED #1",null,"8.a. ED #1",null,"8.a. ED #1",null,null,null,"8.a. ED #1"]
["8.b. ED #2",null,"8.b. ED #2",null,"8.b. ED #2",null,"8.b. ED #2",null,null,null,"8.b. ED #2"]
["9.a. Sheetflow to A/B Soil Conservation Area ",null,"9.a. Sheetflow to A/B Soil Conservation Area ",null,"9.a. Sheetflow to A/B Soil Conservation Area ",null,"9.a. Sheetflow to A/B Soil Conservation Area ",null,null,null,"9.a. Sheetflow to A/B Soil Conservation Area "]
["9.b. Sheetflow to C/D Soil Conservation Area",null,"9.b. Sheetflow to C/D Soil Conservation Area",null,"9.b. Sheetflow to C/D Soil Conservation Area",null,"9.b. Sheetflow to C/D Soil Conservation Area",null,null,null,"9.b. Sheetflow to C/D Soil Conservation Area"]
["9.c. Sheetflow to Vegetated Filter Strip",null,"9.c. Sheetflow to Vegetated Filter Strip",null,"9.c. Sheetflow to Vegetated Filter Strip",null,"9.c. Sheetflow to Vegetated Filter Strip",null,null,null,"9.c. Sheetflow to Vegetated Filter Strip"]
["10.a. Regenerative Stormwater Conveyance #1",null,"10.a. Regenerative Stormwater Conveyance #1",null,"10.a. Regenerative Stormwater Conveyance #1",null,"10.a. Regenerative Stormwater Conveyance #1",null,null,null,"10.a. Regenerative Stormwater Conveyance #1"]
["10.b. Regenerative Stormwater Conveyance #2",null,"10.b. Regenerative Stormwater Conveyance #2",null,"10.b. Regenerative Stormwater Conveyance #2",null,"10.b. Regenerative Stormwater Conveyance #2",null,null,null,"10.b. Regenerative Stormwater Conveyance #2"]
[{"$f":"P165","v":"12.a. Wet Swale #1"},null,{"$f":"P165","v":"12.a. Wet Swale #1"},null,{"$f":"P165","v":"12.a. Wet Swale #1"},null,{"$f":"P165","v":"12.a. Wet Swale #1"},null,null,null,{"$f":"P165","v":"12.a. Wet Swale #1"}]
["12.b. Wet Swale #2",null,"12.b. Wet Swale #2",null,"12.b. Wet Swale #2",null,"12.b. Wet Swale #2",null,null,null,"12.b. Wet Swale #2"]
["13.a. Filtering Practice #1",null,"13.a. Filtering Practice #1",null,"13.a. Filtering Practice #1",null,"13.a. Filtering Practice #1",null,null,null,"13.a. Filtering Practice #1"]
["13.b. Filtering Practice #2",null,"13.b. Filtering Practice #2",null,"13.b. Filtering Practice #2",null,"13.b. Filtering Practice #2",null,null,null,"13.b. Filtering Practice #2"]
["14.a. Constructed Wetland #1",null,"14.a. Constructed Wetland #1",null,"14.a. Constructed Wetland #1",null,"14.a. Constructed Wetland #1",null,null,null,"14.a. Constructed Wetland #1"]
["14.b. Constructed Wetland #2",null,"14.b. Constructed Wetland #2",null,"14.b. Constructed Wetland #2",null,"14.b. Constructed Wetland #2",null,null,null,"14.b. Constructed Wetland #2"]
["15.a. Wet Pond #1",null,{"$f":"P172","v":"15.b. Wet Pond #1 (Coastal Plain)"},null,"15.a. Wet Pond #1",null,"15.a. Wet Pond #1",null,null,null,"15.a. Wet Pond #1"]
[{"$f":"P175","v":"16.a. MTD - Hydrodynamic"},null,{"$f":"P175","v":"16.a. MTD - Hydrodynamic"},null,"15.b. Wet Pond #1 (Coastal Plain)",null,"15.b. Wet Pond #1 (Coastal Plain)",null,null,null,"15.b. Wet Pond #1 (Coastal Plain)"]
[{"$f":"P176","v":"16.b. MTD - Filtering"},null,{"$f":"P176","v":"16.b. MTD - Filtering"},null,"15.c. Wet Pond #2",null,"15.c. Wet Pond #2",null,null,null,"15.c. Wet Pond #2"]
[{"$f":"P177","v":"16.c. MTD - Generic"},null,{"$f":"P177","v":"16.c. MTD - Generic"},null,"15.d. Wet Pond #2 (Coastal Plain)",null,"15.d. Wet Pond #2 (Coastal Plain)",null,null,null,"15.d. Wet Pond #2 (Coastal Plain)"]
[null,null,null,null,{"$f":"P176","v":"16.b. MTD - Filtering"}]
[]
[]
[]
["Options for 10.a. Regenerative Stormwater Conveyance #1",null,"Options for 10.b. Regenerative Stormwater Conveyance #1",null,null,null,"Options for 11.a. Trees over Pervious, A/B",null,null,null,"Options for 11.b. Trees over Pervious, C/D",null,null,"Options for 11.c. Trees over Impervious"]
[]
[{"$f":"P135","v":"None"},null,{"$f":"P135","v":"None"},null,null,null,{"$f":"P135","v":"None"},null,null,null,{"$f":"P135","v":"None"},null,null,{"$f":"P135","v":"None"}]
[null,null,null,null,null,null,{"$f":"P146","v":"4.a. Grass Channel A/B Soils"},null,null,null,{"$f":"P146","v":"4.a. Grass Channel A/B Soils"},null,null,{"$f":"P146","v":"4.a. Grass Channel A/B Soils"}]
[null,null,null,null,null,null,{"$f":"P147","v":"4.b. Grass Channel C/D Soils"},null,null,null,{"$f":"P147","v":"4.b. Grass Channel C/D Soils"},null,null,{"$f":"P147","v":"4.b. Grass Channel C/D Soils"}]
[null,null,null,null,null,null,{"$f":"P148","v":"4.c. Grass Channel Compost Amended Soils"},null,null,null,{"$f":"P148","v":"4.c. Grass Channel Compost Amended Soils"},null,null,"4.c. Grass Channel Compost Amended Soils"]
[null,null,null,null,null,null,"5.a. Dry Swale #1",null,null,null,"5.a. Dry Swale #1",null,null,"5.a. Dry Swale #1"]
[null,null,null,null,null,null,"5.b. Dry Swale #2",null,null,null,"5.b. Dry Swale #2",null,null,"5.b. Dry Swale #2"]
[null,null,null,null,null,null,"6.a. Bioretention #1",null,null,null,"6.a. Bioretention #1",null,null,"6.a. Bioretention #1"]
[null,null,null,null,null,null,"6.b. Bioretention #2",null,null,null,"6.b. Bioretention #2",null,null,"6.b. Bioretention #2"]
[null,null,null,null,null,null,"7.a. Infiltration #1",null,null,null,"7.a. Infiltration #1",null,null,"7.a. Infiltration #1"]
[null,null,null,null,null,null,"7.b. Infiltration #2",null,null,null,"7.b. Infiltration #2",null,null,"7.b. Infiltration #2"]
[null,null,null,null,null,null,"8.a. ED #1",null,null,null,"8.a. ED #1",null,null,"8.a. ED #1"]
[null,null,null,null,null,null,"8.b. ED #2",null,null,null,"8.b. ED #2",null,null,"8.b. ED #2"]
[null,null,null,null,null,null,"9.a. Sheetflow to A/B Soil Conservation Area ",null,null,null,"9.a. Sheetflow to A/B Soil Conservation Area ",null,null,"9.a. Sheetflow to A/B Soil Conservation Area "]
[null,null,null,null,null,null,"9.b. Sheetflow to C/D Soil Conservation Area",null,null,null,"9.b. Sheetflow to C/D Soil Conservation Area",null,null,"9.b. Sheetflow to C/D Soil Conservation Area"]
[null,null,null,null,null,null,"9.c. Sheetflow to Vegetated Filter Strip",null,null,null,"9.c. Sheetflow to Vegetated Filter Strip",null,null,"9.c. Sheetflow to Vegetated Filter Strip"]
[null,null,null,null,null,null,"10.a. Regenerative Stormwater Conveyance #1",null,null,null,"10.a. Regenerative Stormwater Conveyance #1",null,null,"10.a. Regenerative Stormwater Conveyance #1"]
[null,null,null,null,null,null,"10.b. Regenerative Stormwater Conveyance #2",null,null,null,"10.b. Regenerative Stormwater Conveyance #2",null,null,"10.b. Regenerative Stormwater Conveyance #2"]
[null,null,null,null,null,null,{"$f":"P165","v":"12.a. Wet Swale #1"},null,null,null,{"$f":"P165","v":"12.a. Wet Swale #1"},null,null,{"$f":"P165","v":"12.a. Wet Swale #1"}]
[null,null,null,null,null,null,{"$f":"P166","v":"12.b. Wet Swale #2"},null,null,null,{"$f":"P166","v":"12.b. Wet Swale #2"},null,null,{"$f":"P166","v":"12.b. Wet Swale #2"}]
[null,null,null,null,null,null,{"$f":"P167","v":"13.a. Filtering Practice #1"},null,null,null,{"$f":"P167","v":"13.a. Filtering Practice #1"},null,null,"13.a. Filtering Practice #1"]
[null,null,null,null,null,null,"13.b. Filtering Practice #2",null,null,null,"13.b. Filtering Practice #2",null,null,"13.b. Filtering Practice #2"]
[null,null,null,null,null,null,"14.a. Constructed Wetland #1",null,null,null,"14.a. Constructed Wetland #1",null,null,"14.a. Constructed Wetland #1"]
[null,null,null,null,null,null,"14.b. Constructed Wetland #2",null,null,null,"14.b. Constructed Wetland #2",null,null,"14.b. Constructed Wetland #2"]
[null,null,null,null,null,null,"15.a. Wet Pond #1",null,null,null,"15.a. Wet Pond #1",null,null,"15.a. Wet Pond #1"]
[null,null,null,null,null,null,"15.b. Wet Pond #1 (Coastal Plain)",null,null,null,"15.b. Wet Pond #1 (Coastal Plain)",null,null,"15.b. Wet Pond #1 (Coastal Plain)"]
[null,null,null,null,null,null,"15.c. Wet Pond #2",null,null,null,"15.c. Wet Pond #2",null,null,"15.c. Wet Pond #2"]
[null,null,null,null,null,null,"15.d. Wet Pond #2 (Coastal Plain)",null,null,null,"15.d. Wet Pond #2 (Coastal Plain)",null,null,"15.d. Wet Pond #2 (Coastal Plain)"]
[null,null,null,null,null,null,"16.a. MTD - Hydrodynamic",null,null,null,"16.a. MTD - Hydrodynamic",null,null,"16.a. MTD - Hydrodynamic"]
[null,null,null,null,null,null,"16.b. MTD - Filtering",null,null,null,"16.b. MTD - Filtering",null,null,"16.b. MTD - Filtering"]
[null,null,null,null,null,null,"16.c. MTD - Generic",null,null,null,"16.c. MTD - Generic",null,null,"16.c. MTD - Generic"]

{"sheet":"D.A. B","index":4,"n_rows":340,"n_cols":24,"rows_kept":340,"cut":false,"hidden":false,"merged":[[64,14,64,15],[100,14,100,15],[101,14,101,15],[102,14,102,15],[91,14,91,15],[94,14,94,15],[95,14,95,15],[96,14,96,15],[97,14,97,15],[99,0,99,1],[80,16,80,17],[82,14,82,15],[83,14,83,15],[86,14,86,15],[87,14,87,15],[90,14,90,15],[80,1,80,2],[55,14,55,15],[58,14,58,15],[59,14,59,15],[62,14,62,15],[63,14,63,15],[54,14,54,15],[33,14,33,15],[34,14,34,15],[37,14,37,15],[38,14,38,15],[41,14,41,15],[42,14,42,15],[45,14,45,15],[46,14,46,15],[49,14,49,15],[50,14,50,15],[53,14,53,15],[32,14,32,15],[17,14,17,15],[18,14,18,15],[19,14,19,15],[20,14,20,15],[21,14,21,15],[22,14,22,15],[23,14,23,15],[24,14,24,15],[25,14,25,15],[28,14,28,15],[29,14,29,15],[14,14,14,15],[0,3,0,4],[7,9,7,12],[8,9,8,12],[11,14,11,15],[13,14,13,15],[10,14,10,15]]}
["Drainage Area B",null,null,null,null,null,null,null,null,null,null,null,null,"VRRM 4.1, 2024"]
[]
["Drainage Area B Land Cover  (acres)"]
[null,"A Soils","B Soils","C Soils","D Soils","Totals","Land Cover Rv","Composite Loading P",null,null,null,null,null,null,null,null,null,"Composite Loading N"]
["Forest (acres)",null,null,null,null,{"$f":"SUMIF(B5:E5,\">=0\")","v":0},{"$f":"IF(F5>0,(B5*Constants!$B$7+C5*Constants!$C$7+D5*Constants!$D$7+E5*Constants!$E$7)/F5,0)","v":0},{"$f":"IF(G5>0,(B5*Constants!$B14/F5)+(C5*Constants!$C14/F5)+(D5*Constants!$D14/F5)+(E5*Constants!$E14/F5),0)","v":0},null,null,null,null,null,null,null,null,null,{"$f":"IF(G5>0,(B5*Constants!$B21/F5)+(C5*Constants!$C21/F5)+(D5*Constants!$D21/F5)+(E5*Constants!$E21/F5),0)","v":0}]
["Mixed Open (acres)",null,null,null,null,{"$f":"SUMIF(B6:E6,\">=0\")","v":0},{"$f":"IF(F6>0,(B6*Constants!$B$8+C6*Constants!$C$8+D6*Constants!$D$8+E6*Constants!$E$8)/F6,0)","v":0},{"$f":"IF(G6>0,(B6*Constants!$B15/F6)+(C6*Constants!$C15/F6)+(D6*Constants!$D15/F6)+(E6*Constants!$E15/F6),0)","v":0},null,null,null,null,null,null,null,null,null,{"$f":"IF(G6>0,(B6*Constants!$B22/F6)+(C6*Constants!$C22/F6)+(D6*Constants!$D22/F6)+(E6*Constants!$E22/F6),0)","v":0}]
["Managed Turf (acres)",null,null,null,null,{"$f":"SUMIF(B7:E7,\">=0\")","v":0},{"$f":"IF(F7>0,(B7*Constants!$B$9+C7*Constants!$C$9+D7*Constants!$D$9+E7*Constants!$E$9)/F7,0)","v":0},{"$f":"IF(G7>0,(B7*Constants!$B16/F7)+(C7*Constants!$C16/F7)+(D7*Constants!$D16/F7)+(E7*Constants!$E16/F7),0)","v":0},null,null,null,null,null,null,null,null,null,{"$f":"IF(G7>0,(B7*Constants!$B23/F7)+(C7*Constants!$C23/F7)+(D7*Constants!$D23/F7)+(E7*Constants!$E23/F7),0)","v":0}]
["Impervious Cover (acres) ",null,null,null,null,{"$f":"SUMIF(B8:E8,\">=0\")","v":0},{"$f":"IF(F8>0,(B8*Constants!$B$10+C8*Constants!$C$10+D8*Constants!$D$10+E8*Constants!$E$10)/F8,0)","v":0},{"$f":"IF(G8>0,(B8*Constants!$B17/F8)+(C8*Constants!$C17/F8)+(D8*Constants!$D17/F8)+(E8*Constants!$E17/F8),0)","v":0},null,"     Total Phosphorus Available for Removal in D.A. B (lb/yr)",null,null,null,{"$f":"SUMPRODUCT(B6:E8,Constants!B15:E17)","v":0},null,null,null,{"$f":"IF(G8>0,(B8*Constants!$B24/F8)+(C8*Constants!$C24/F8)+(D8*Constants!$D24/F8)+(E8*Constants!$E24/F8),0)","v":0}]
[null,null,null,null,"Total",{"$f":"SUM(F5:F8)","v":0},null,null,null,"Post Development Treatment Volume in D.A. B (ft3)",null,null,null,{"$f":"IFERROR(Constants!$B$2/12*(F7*G7+F8*G8+F6*G6)/(F7+F8+F6)*(F7+F8+F6)*43560,0)","v":0}]
[]
["Stormwater Best Management Practices (RR = Runoff Reduction)",null,null,null,null,null,null,null,null,null,null,null,null,null,"--Select from dropdown lists--"]
["Practice","Runoff Reduction Credit (%)","Mixed Open Credit Area (acres) ","Managed Turf Credit Area (acres) ","Impervious Cover Credit Area (acres)","Volume from Upstream Practice (ft3)","Runoff Reduction (ft3)","Remaining Runoff Volume  (ft3)","Total BMP Treatment Volume (ft3)","Phosphorus Removal Efficiency (%)","Phosphorus Load from Upstream Practices (lb)","Untreated Phosphorus Load to Practice (lb)","Phosphorus Removed By Practice (lb)","Remaining Phosphorus Load (lb)","Downstream Practice to be Employed",null,null,"Nitrogen Removal Efficiency (%)","Nitrogen Load from Upstream  Practices (lbs)","Untreated Nitrogen Load to Practice (lbs)","Nitrogen Removed By Practice (lbs)","Remaining Nitrogen Load (lbs)"]
["1. Vegetated Roof (RR)",null,null,null,null,null,null,null,null,null,null,null,null,null,null,null,null,"1. Vegetated Roof (RR)"]
["1.a. Vegetated Roof #1 (P-FIL-02)",{"$f":"Constants!$B28","v":45},null,null,null,null,{"$f":"(Constants!$B$2*($G$8*$E14)*3630)*$B14/100","v":0},{"$f":"(Constants!$B$2*($G$8*$E14)*3630)*(1-$B14/100)","v":0},{"$f":"+$G14+$H14","v":0},{"$f":"Constants!C28","v":0},null,{"$f":"E14*$H$8","v":0},{"$f":"IFERROR($L14*($G14+$H14*$J14/100)/($I14),0)","v":0},{"$f":"$L14-$M14","v":0},null,null,null,{"$f":"Constants!$D28","v":0},null,{"$f":"E14*$R$8","v":0},{"$f":"IFERROR($T14*($G14+$H14*$R14/100)/$I14,0)","v":0},{"$f":"$T14-$U14","v":0}]
["1.b. Vegetated Roof #2 (P-FIL-02)",{"$f":"Constants!$B29","v":60},null,null,null,null,{"$f":"(Constants!$B$2*($G$8*$E15)*3630)*$B15/100","v":0},{"$f":"(Constants!$B$2*($G$8*$E15)*3630)*(1-$B15/100)","v":0},{"$f":"+$G15+$H15","v":0},{"$f":"Constants!C29","v":0},null,{"$f":"E15*$H$8","v":0},{"$f":"IFERROR($L15*($G15+$H15*$J15/100)/($I15),0)","v":0},{"$f":"$L15-$M15","v":0},null,null,null,{"$f":"Constants!$D29","v":0},null,{"$f":"E15*$R$8","v":0},{"$f":"IFERROR($T15*($G15+$H15*$R15/100)/$I15,0)","v":0},{"$f":"$T15-$U15","v":0}]
[]
["2. Rooftop Disconnection (RR)",null,null,null,null,null,null,null,null,null,null,null,null,null,null,null,null,"2. Rooftop Disconnection (RR)"]
["2.a. Simple Disconnection to A/B Soils \n(P-FIL-01)",{"$f":"Constants!$B32","v":50},null,null,null,{"$f":"SUMIF($O$14:$O$103,P136,$H$14:$H$103)","v":0},{"$f":"(Constants!$B$2*($G$8*$E18)*3630)*$B18/100","v":0},{"$f":"(Constants!$B$2*($G$8*$E18)*3630)*(1-$B18/100)","v":0},{"$f":"+$G18+$H18","v":0},{"$f":"Constants!C32","v":0},{"$f":"SUMIF($O$13:$O$103,P136,$N$13:$N$103)","v":0},{"$f":"E18*$H$8","v":0},{"$f":"IFERROR(($K18+$L18)*($G18+$H18*$J18/100)/$I18,0)","v":0},{"$f":"$K18+$L18-$M18","v":0},null,null,null,{"$f":"Constants!$D32","v":0},{"$f":"SUMIF($O$14:$O$103,$P136,$V$14:$V$103)","v":0},{"$f":"E18*$R$8","v":0},{"$f":"IFERROR(($S18+$T18)*($G18+$H18*$R18/100)/$I18,0)","v":0},{"$f":"$S18+$T18-$U18","v":0}]
["2.b. Simple Disconnection to C/D Soils \n(P-FIL-01)",{"$f":"Constants!$B33","v":25},null,null,null,0,{"$f":"(Constants!$B$2*($G$8*$E19)*3630)*$B19/100","v":0},{"$f":"(Constants!$B$2*($G$8*$E19)*3630)*(1-$B19/100)","v":0},{"$f":"+$G19+$H19","v":0},{"$f":"Constants!C33","v":0},0,{"$f":"E19*$H$8","v":0},{"$f":"IFERROR(($K19+$L19)*($G19+$H19*$J19/100)/$I19,0)","v":0},{"$f":"$K19+$L19-$M19","v":0},null,null,null,{"$f":"Constants!$D33","v":0},0,0,{"$f":"IFERROR(($S19+$T19)*($G19+$H19*$R19/100)/$I19,0)","v":0},{"$f":"$S19+$T19-$U19","v":0}]
["2.c. To Soil Amended Filter Path as per specifications (existing C/D soils) (P-FIL-08)",{"$f":"Constants!$B34","v":50},null,null,null,0,{"$f":"(Constants!$B$2*($G$8*$E20)*3630)*$B20/100","v":0},{"$f":"(Constants!$B$2*($G$8*$E20)*3630)*(1-$B20/100)","v":0},0,{"$f":"Constants!C34","v":0},0,{"$f":"E20*$H$8","v":0},0,0,null,null,null,{"$f":"Constants!$D34","v":0},0,0,0,0]
["2.d. To Dry Well or French Drain #1, \nMicro-Infilration #1 (P-FIL-04)",{"$f":"Constants!$B35","v":50},null,null,null,0,{"$f":"(Constants!$B$2*($G$8*$E21)*3630)*$B21/100","v":0},{"$f":"(Constants!$B$2*($G$8*$E21)*3630)*(1-$B21/100)","v":0},0,{"$f":"Constants!C35","v":25},0,0,0,{"$f":"$K21+$L21-$M21","v":0},null,null,null,{"$f":"Constants!$D35","v":15},0,0,0,0]
["2.e. To Dry Well or French Drain #2, \nMicro-Infiltration #2 (P-FIL-04)",{"$f":"Constants!$B36","v":90},null,null,null,0,{"$f":"(Constants!$B$2*($G$8*$E22)*3630)*$B22/100","v":0},{"$f":"(Constants!$B$2*($G$8*$E22)*3630)*(1-$B22/100)","v":0},0,{"$f":"Constants!C36","v":25},0,0,0,0,null,null,null,{"$f":"Constants!$D36","v":15},0,0,0,0]
["2.f. To Rain Garden #1, \nMicro-Bioretention #1 (P-FIL-05)",{"$f":"Constants!$B37","v":40},null,null,null,0,{"$f":"(Constants!$B$2*($G$8*$E23)*3630)*$B23/100","v":0},{"$f":"(Constants!$B$2*($G$8*$E23)*3630)*(1-$B23/100)","v":0},0,{"$f":"Constants!C37","v":25},0,0,0,0,null,null,null,{"$f":"Constants!$D37","v":40},0,0,0,0]
["2.g. To Rain Garden #2, \nMicro-Bioretention #2 (P-FIL-05)",{"$f":"Constants!$B38","v":80},null,null,null,0,{"$f":"(Constants!$B$2*($G$8*$E24)*3630)*$B24/100","v":0},{"$f":"(Constants!$B$2*($G$8*$E24)*3630)*(1-$B24/100)","v":0},{"$f":"+$G24+$H24","v":0},{"$f":"Constants!C38","v":50},0,0,0,0,null,null,null,{"$f":"Constants!$D38","v":60},0,0,0,0]
["2.h. To Rainwater Harvesting (P-BAS-04)",0,null,null,null,0,{"$f":"(Constants!$B$2*($G$8*$E25)*3630)*$B25/100","v":0},{"$f":"(Constants!$B$2*($G$8*$E25)*3630)*(1-$B25/100)","v":0},0,{"$f":"Constants!C39","v":0},0,0,0,0,null,null,null,{"$f":"Constants!$D39","v":0},0,0,0,0]
["2.i. To Stormwater Planter, \nUrban Bioretention (P-FIL-05)",{"$f":"Constants!$B40","v":40},null,null,null,0,{"$f":"(Constants!$B$2*($G$8*$E26)*3630)*$B26/100","v":0},{"$f":"(Constants!$B$2*($G$8*$E26)*3630)*(1-$B26/100)","v":0},0,{"$f":"Constants!C40","v":25},0,0,{"$f":"IFERROR(($K26+$L26)*($G26+$H26*$J26/100)/$I26,0)","v":0},0,null,null,null,{"$f":"Constants!$D40","v":40},0,0,0,0]
[]
["3. Permeable Pavement  (RR)",null,null,null,null,null,null,null,null,null,null,null,null,null,null,null,null,"3. Permeable Pavement  (RR)"]
["3.a. Permeable Pavement #1 (P-FIL-03)",{"$f":"Constants!$B43","v":45},null,null,null,{"$f":"SUMIF($O$14:$O$103,P145,$H$14:$H$103)","v":0},{"$f":"(Constants!$B$2*($G$8*$E29)*3630)*$B29/100","v":0},{"$f":"(Constants!$B$2*($G$8*$E29)*3630)*(1-$B29/100)","v":0},{"$f":"+$G29+$H29","v":0},{"$f":"Constants!C43","v":25},{"$f":"SUMIF($O$13:$O$103,P145,$N$13:$N$103)","v":0},{"$f":"E29*$H$8","v":0},{"$f":"IFERROR(($K29+$L29)*($G29+$H29*$J29/100)/$I29,0)","v":0},{"$f":"$K29+$L29-$M29","v":0},null,null,null,{"$f":"Constants!$D43","v":25},{"$f":"SUMIF($O$14:$O$103,$P145,$V$14:$V$103)","v":0},{"$f":"E29*$R$8","v":0},{"$f":"IFERROR(($S29+$T29)*($G29+$H29*$R29/100)/$I29,0)","v":0},{"$f":"$S29+$T29-$U29","v":0}]
["3.b. Permeable Pavement #2 (P-FIL-03)",{"$f":"Constants!$B44","v":75},null,null,null,null,{"$f":"(Constants!$B$2*($G$8*$E30)*3630)*$B30/100","v":0},{"$f":"(Constants!$B$2*($G$8*$E30)*3630)*(1-$B30/100)","v":0},{"$f":"+$G30+$H30","v":0},{"$f":"Constants!C44","v":25},null,{"$f":"E30*$H$8","v":0},{"$f":"IFERROR(($K30+$L30)*($G30+$H30*$J30/100)/$I30,0)","v":0},{"$f":"$L30-$M30","v":0},null,null,null,{"$f":"Constants!$D44","v":25},null,{"$f":"E30*$R$8","v":0},{"$f":"IFERROR(($S30+$T30)*($G30+$H30*$R30/100)/$I30,0)","v":0},{"$f":"$S30+$T30-$U30","v":0}]
[]
["4. Grass Channel (RR)",null,null,null,null,null,null,null,null,null,null,null,null,null,null,null,null,"4. Grass Channel (RR)"]
["4.a. Grass Channel A/B Soils (P-CNV-01)",{"$f":"Constants!$B47","v":20},null,null,null,{"$f":"SUMIF($O$14:$O$103,P146,$H$14:$H$103)","v":0},{"$f":"(Constants!$B$2*($G$7*$D33+$G$8*$E33+$C33*$G$6)*3630+$F33)*$B33/100","v":0},{"$f":"(Constants!$B$2*($G$7*$D33+$G$8*$E33+$C33*$G$6)*3630+$F33)*(1-$B33/100)","v":0},{"$f":"+$G33+$H33","v":0},{"$f":"Constants!C47","v":15},{"$f":"SUMIF($O$13:$O$103,P146,$N$13:$N$103)","v":0},{"$f":"(D33*$H$7)+(C33*$H$6)+(E33*$H$8)","v":0},{"$f":"IFERROR(($K33+$L33)*($G33+$H33*$J33/100)/$I33,0)","v":0},{"$f":"$K33+$L33-$M33","v":0},null,null,null,{"$f":"Constants!$D47","v":20},{"$f":"SUMIF($O$14:$O$103,$P146,$V$14:$V$103)","v":0},{"$f":"(D33*$R$7)+(C33*$R$6)+(E33*$R$8)","v":0},{"$f":"IFERROR(($S33+$T33)*($G33+$H33*$R33/100)/$I33,0)","v":0},{"$f":"$S33+$T33-$U33","v":0}]
["4.b. Grass Channel C/D Soils (P-CNV-01)",{"$f":"Constants!$B48","v":10},null,null,null,{"$f":"SUMIF($O$14:$O$103,P147,$H$14:$H$103)","v":0},{"$f":"(Constants!$B$2*($G$7*$D34+$G$8*$E34+$C34*$G$6)*3630+$F34)*$B34/100","v":0},{"$f":"(Constants!$B$2*($G$7*$D34+$G$8*$E34+$C34*$G$6)*3630+$F34)*(1-$B34/100)","v":0},{"$f":"+$G34+$H34","v":0},{"$f":"Constants!C48","v":15},{"$f":"SUMIF($O$13:$O$103,P147,$N$13:$N$103)","v":0},{"$f":"(D34*$H$7)+(C34*$H$6)+(E34*$H$8)","v":0},{"$f":"IFERROR(($K34+$L34)*($G34+$H34*$J34/100)/$I34,0)","v":0},{"$f":"$K34+$L34-$M34","v":0},null,null,null,{"$f":"Constants!$D48","v":20},{"$f":"SUMIF($O$14:$O$103,$P147,$V$14:$V$103)","v":0},{"$f":"(D34*$R$7)+(C34*$R$6)+(E34*$R$8)","v":0},{"$f":"IFERROR(($S34+$T34)*($G34+$H34*$R34/100)/$I34,0)","v":0},{"$f":"$S34+$T34-$U34","v":0}]
["4.c. Grass Channel with Compost Amended Soils as per specs (P-FIL-08)",{"$f":"Constants!$B49","v":20},null,null,null,{"$f":"SUMIF($O$14:$O$103,P148,$H$14:$H$103)","v":0},{"$f":"(Constants!$B$2*($G$7*$D35+$G$8*$E35+$C35*$G$6)*3630+$F35)*$B35/100","v":0},{"$f":"(Constants!$B$2*($G$7*$D35+$G$8*$E35+$C35*$G$6)*3630+$F35)*(1-$B35/100)","v":0},{"$f":"+$G35+$H35","v":0},{"$f":"Constants!C49","v":15},{"$f":"SUMIF($O$13:$O$103,P148,$N$13:$N$103)","v":0},{"$f":"(D35*$H$7)+(C35*$H$6)+(E35*$H$8)","v":0},{"$f":"IFERROR(($K35+$L35)*($G35+$H35*$J35/100)/$I35,0)","v":0},{"$f":"$K35+$L35-$M35","v":0},null,null,null,{"$f":"Constants!$D49","v":20},{"$f":"SUMIF($O$14:$O$103,$P148,$V$14:$V$103)","v":0},{"$f":"(D35*$R$7)+(C35*$R$6)+(E35*$R$8)","v":0},{"$f":"IFERROR(($S35+$T35)*($G35+$H35*$R35/100)/$I35,0)","v":0},{"$f":"$S35+$T35-$U35","v":0}]
[null,null,null,null,null,null,null,null,null,null,null,null,null,null,null,null,null,null,null,null,null,null,null,"`"]
["5. Dry Swale (RR)",null,null,null,null,null,null,null,null,null,null,null,null,null,null,null,null,"5. Dry Swale (RR)"]
["5.a. Dry Swale #1 (P-CNV-02)",{"$f":"Constants!$B52","v":40},null,null,null,{"$f":"SUMIF($O$14:$O$103,P149,$H$14:$H$103)","v":0},{"$f":"(Constants!$B$2*($G$7*$D38+$G$8*$E38+$C38*$G$6)*3630+$F38)*$B38/100","v":0},{"$f":"(Constants!$B$2*($G$7*$D38+$G$8*$E38+$C38*$G$6)*3630+$F38)*(1-$B38/100)","v":0},{"$f":"+$G38+$H38","v":0},{"$f":"Constants!C52","v":20},{"$f":"SUMIF($O$13:$O$103,P149,$N$13:$N$103)","v":0},{"$f":"(D38*$H$7)+(C38*$H$6)+(E38*$H$8)","v":0},{"$f":"IFERROR(($K38+$L38)*($G38+$H38*$J38/100)/$I38,0)","v":0},{"$f":"$K38+$L38-$M38","v":0},null,null,null,{"$f":"Constants!$D52","v":25},{"$f":"SUMIF($O$14:$O$103,$P149,$V$14:$V$103)","v":0},{"$f":"(D38*$R$7)+(C38*$R$6)+(E38*$R$8)","v":0},{"$f":"IFERROR(($S38+$T38)*($G38+$H38*$R38/100)/$I38,0)","v":0},{"$f":"$S38+$T38-$U38","v":0}]
["5.b. Dry Swale #2 (P-CNV-02)",{"$f":"Constants!$B53","v":60},null,null,null,{"$f":"SUMIF($O$14:$O$103,P150,$H$14:$H$103)","v":0},{"$f":"(Constants!$B$2*($G$7*$D39+$G$8*$E39+$C39*$G$6)*3630+$F39)*$B39/100","v":0},{"$f":"(Constants!$B$2*($G$7*$D39+$G$8*$E39+$C39*$G$6)*3630+$F39)*(1-$B39/100)","v":0},{"$f":"+$G39+$H39","v":0},{"$f":"Constants!C53","v":40},{"$f":"SUMIF($O$13:$O$103,P150,$N$13:$N$103)","v":0},{"$f":"(D39*$H$7)+(C39*$H$6)+(E39*$H$8)","v":0},{"$f":"IFERROR(($K39+$L39)*($G39+$H39*$J39/100)/$I39,0)","v":0},{"$f":"$K39+$L39-$M39","v":0},null,null,null,{"$f":"Constants!$D53","v":35},{"$f":"SUMIF($O$14:$O$103,$P150,$V$14:$V$103)","v":0},{"$f":"(D39*$R$7)+(C39*$R$6)+(E39*$R$8)","v":0},{"$f":"IFERROR(($S39+$T39)*($G39+$H39*$R39/100)/$I39,0)","v":0},{"$f":"$S39+$T39-$U39","v":0}]
[]
["6. Bioretention (RR)",null,null,null,null,null,null,null,null,null,null,null,null,null,null,null,null,"6. Bioretention (RR)"]
["6.a. Bioretention #1 or Micro-Bioretention #1 or Urban Bioretention (P-FIL-05)",{"$f":"Constants!$B56","v":40},null,null,null,{"$f":"SUMIF($O$14:$O$103,P151,$H$14:$H$103)","v":0},{"$f":"(Constants!$B$2*($G$7*$D42+$G$8*$E42+$C42*$G$6)*3630+$F42)*$B42/100","v":0},{"$f":"(Constants!$B$2*($G$7*$D42+$G$8*$E42+$C42*$G$6)*3630+$F42)*(1-$B42/100)","v":0},{"$f":"+$G42+$H42","v":0},{"$f":"Constants!C56","v":25},{"$f":"SUMIF($O$13:$O$103,P151,$N$13:$N$103)","v":0},{"$f":"(D42*$H$7)+(C42*$H$6)+(E42*$H$8)","v":0},{"$f":"IFERROR(($K42+$L42)*($G42+$H42*$J42/100)/$I42,0)","v":0},{"$f":"$K42+$L42-$M42","v":0},null,null,null,{"$f":"Constants!$D56","v":40},{"$f":"SUMIF($O$14:$O$103,$P151,$V$14:$V$103)","v":0},{"$f":"(D42*$R$7)+(C42*$R$6)+(E42*$R$8)","v":0},{"$f":"IFERROR(($S42+$T42)*($G42+$H42*$R42/100)/$I42,0)","v":0},{"$f":"$S42+$T42-$U42","v":0}]
["6.b. Bioretention #2 or \nMicro-Bioretention #2 (P-FIL-05)",{"$f":"Constants!$B57","v":80},null,null,null,{"$f":"SUMIF($O$14:$O$103,P152,$H$14:$H$103)","v":0},{"$f":"(Constants!$B$2*($G$7*$D43+$G$8*$E43+$C43*$G$6)*3630+$F43)*$B43/100","v":0},{"$f":"(Constants!$B$2*($G$7*$D43+$G$8*$E43+$C43*$G$6)*3630+$F43)*(1-$B43/100)","v":0},{"$f":"+$G43+$H43","v":0},{"$f":"Constants!C57","v":50},{"$f":"SUMIF($O$13:$O$103,P152,$N$13:$N$103)","v":0},{"$f":"(D43*$H$7)+(C43*$H$6)+(E43*$H$8)","v":0},{"$f":"IFERROR(($K43+$L43)*($G43+$H43*$J43/100)/$I43,0)","v":0},{"$f":"$K43+$L43-$M43","v":0},null,null,null,{"$f":"Constants!$D57","v":60},{"$f":"SUMIF($O$14:$O$103,$P152,$V$14:$V$103)","v":0},{"$f":"(D43*$R$7)+(C43*$R$6)+(E43*$R$8)","v":0},{"$f":"IFERROR(($S43+$T43)*($G43+$H43*$R43/100)/$I43,0)","v":0},{"$f":"$S43+$T43-$U43","v":0}]
[]
["7. Infiltration (RR)",null,null,null,null,null,null,null,null,null,null,null,null,null,null,null,null,"7. Infiltration (RR)"]
["7.a. Infiltration #1 (P-FIL-04)",{"$f":"Constants!$B60","v":50},null,null,null,{"$f":"SUMIF($O$14:$O$103,P153,$H$14:$H$103)","v":0},{"$f":"(Constants!$B$2*($G$7*$D46+$G$8*$E46+$C46*$G$6)*3630+$F46)*$B46/100","v":0},{"$f":"(Constants!$B$2*($G$7*$D46+$G$8*$E46+$C46*$G$6)*3630+$F46)*(1-$B46/100)","v":0},{"$f":"+$G46+$H46","v":0},{"$f":"Constants!C60","v":25},{"$f":"SUMIF($O$13:$O$103,P153,$N$13:$N$103)","v":0},{"$f":"(D46*$H$7)+(C46*$H$6)+(E46*$H$8)","v":0},{"$f":"IFERROR(($K46+$L46)*($G46+$H46*$J46/100)/$I46,0)","v":0},{"$f":"$K46+$L46-$M46","v":0},null,null,null,{"$f":"Constants!$D60","v":15},{"$f":"SUMIF($O$14:$O$103,$P153,$V$14:$V$103)","v":0},{"$f":"(D46*$R$7)+(C46*$R$6)+(E46*$R$8)","v":0},{"$f":"IFERROR(($S46+$T46)*($G46+$H46*$R46/100)/$I46,0)","v":0},{"$f":"$S46+$T46-$U46","v":0}]
["7.b. Infiltration #2 (P-FIL-04)",{"$f":"Constants!$B61","v":90},null,null,null,{"$f":"SUMIF($O$14:$O$103,P154,$H$14:$H$103)","v":0},{"$f":"(Constants!$B$2*($G$7*$D47+$G$8*$E47+$C47*$G$6)*3630+$F47)*$B47/100","v":0},{"$f":"(Constants!$B$2*($G$7*$D47+$G$8*$E47+$C47*$G$6)*3630+$F47)*(1-$B47/100)","v":0},{"$f":"+$G47+$H47","v":0},{"$f":"Constants!C61","v":25},{"$f":"SUMIF($O$13:$O$103,P154,$N$13:$N$103)","v":0},{"$f":"(D47*$H$7)+(C47*$H$6)+(E47*$H$8)","v":0},{"$f":"IFERROR(($K47+$L47)*($G47+$H47*$J47/100)/$I47,0)","v":0},{"$f":"$K47+$L47-$M47","v":0},null,null,null,{"$f":"Constants!$D61","v":15},{"$f":"SUMIF($O$14:$O$103,$P154,$V$14:$V$103)","v":0},{"$f":"(D47*$R$7)+(C47*$R$6)+(E47*$R$8)","v":0},{"$f":"IFERROR(($S47+$T47)*($G47+$H47*$R47/100)/$I47,0)","v":0},{"$f":"$S47+$T47-$U47","v":0}]
[]
["8. Extended Detention Pond (RR)",null,null,null,null,null,null,null,null,null,null,null,null,null,null,null,null,"8. Extended Detention Pond (RR)"]
["8.a. ED #1 (P-BAS-03)",{"$f":"Constants!$B64","v":0},null,null,null,{"$f":"SUMIF($O$14:$O$103,P155,$H$14:$H$103)","v":0},{"$f":"(Constants!$B$2*($G$7*$D50+$G$8*$E50+$C50*$G$6)*3630+$F50)*$B50/100","v":0},{"$f":"(Constants!$B$2*($G$7*$D50+$G$8*$E50+$C50*$G$6)*3630+$F50)*(1-$B50/100)","v":0},{"$f":"+$G50+$H50","v":0},{"$f":"Constants!C64","v":15},{"$f":"SUMIF($O$13:$O$103,P155,$N$13:$N$103)","v":0},{"$f":"(D50*$H$7)+(C50*$H$6)+(E50*$H$8)","v":0},{"$f":"IFERROR(($K50+$L50)*($G50+$H50*$J50/100)/$I50,0)","v":0},{"$f":"$K50+$L50-$M50","v":0},null,null,null,{"$f":"Constants!$D64","v":10},{"$f":"SUMIF($O$14:$O$103,$P155,$V$14:$V$103)","v":0},{"$f":"(D50*$R$7)+(C50*$R$6)+(E50*$R$8)","v":0},{"$f":"IFERROR(($S50+$T50)*($G50+$H50*$R50/100)/$I50,0)","v":0},{"$f":"$S50+$T50-$U50","v":0}]
["8.b. ED #2 (P-BAS-03)",{"$f":"Constants!$B65","v":15},null,null,null,{"$f":"SUMIF($O$14:$O$103,P156,$H$14:$H$103)","v":0},{"$f":"(Constants!$B$2*($G$7*$D51+$G$8*$E51+$C51*$G$6)*3630+$F51)*$B51/100","v":0},{"$f":"(Constants!$B$2*($G$7*$D51+$G$8*$E51+$C51*$G$6)*3630+$F51)*(1-$B51/100)","v":0},{"$f":"+$G51+$H51","v":0},{"$f":"Constants!C65","v":15},{"$f":"SUMIF($O$13:$O$103,P156,$N$13:$N$103)","v":0},{"$f":"(D51*$H$7)+(C51*$H$6)+(E51*$H$8)","v":0},{"$f":"IFERROR(($K51+$L51)*($G51+$H51*$J51/100)/$I51,0)","v":0},{"$f":"$K51+$L51-$M51","v":0},null,null,null,{"$f":"Constants!$D65","v":10},{"$f":"SUMIF($O$14:$O$103,$P156,$V$14:$V$103)","v":0},{"$f":"(D51*$R$7)+(C51*$R$6)+(E51*$R$8)","v":0},{"$f":"IFERROR(($S51+$T51)*($G51+$H51*$R51/100)/$I51,0)","v":0},{"$f":"$S51+$T51-$U51","v":0}]
[]
["9. Sheetflow to Filter/Open Space (RR)",null,null,null,null,null,null,null,null,null,null,null,null,null,null,null,null,"9. Sheetflow to Filter/Open Space (RR)"]
["9.a. Sheetflow to Conservation Area, A/B Soils (P-FIL-07)",{"$f":"Constants!$B68","v":75},null,null,null,{"$f":"SUMIF($O$14:$O$103,P157,$H$14:$H$103)","v":0},{"$f":"(Constants!$B$2*($G$7*$D54+$G$8*$E54+$C54*$G$6)*3630+$F54)*$B54/100","v":0},{"$f":"(Constants!$B$2*($G$7*$D54+$G$8*$E54+$C54*$G$6)*3630+$F54)*(1-$B54/100)","v":0},{"$f":"+$G54+$H54","v":0},{"$f":"Constants!C68","v":0},{"$f":"SUMIF($O$13:$O$103,P157,$N$13:$N$103)","v":0},{"$f":"(D54*$H$7)+(C54*$H$6)+(E54*$H$8)","v":0},{"$f":"IFERROR(($K54+$L54)*($G54+$H54*$J54/100)/$I54,0)","v":0},{"$f":"$K54+$L54-$M54","v":0},null,null,null,{"$f":"Constants!$D68","v":0},{"$f":"SUMIF($O$14:$O$103,$P157,$V$14:$V$103)","v":0},{"$f":"(D54*$R$7)+(C54*$R$6)+(E54*$R$8)","v":0},{"$f":"IFERROR(($S54+$T54)*($G54+$H54*$R54/100)/$I54,0)","v":0},{"$f":"$S54+$T54-$U54","v":0}]
["9.b. Sheetflow to Conservation Area, C/D Soils (P-FIL-07)",{"$f":"Constants!$B69","v":50},null,null,null,{"$f":"SUMIF($O$14:$O$103,P158,$H$14:$H$103)","v":0},{"$f":"(Constants!$B$2*($G$7*$D55+$G$8*$E55+$C55*$G$6)*3630+$F55)*$B55/100","v":0},{"$f":"(Constants!$B$2*($G$7*$D55+$G$8*$E55+$C55*$G$6)*3630+$F55)*(1-$B55/100)","v":0},{"$f":"+$G55+$H55","v":0},{"$f":"Constants!C69","v":0},{"$f":"SUMIF($O$13:$O$103,P158,$N$13:$N$103)","v":0},{"$f":"(D55*$H$7)+(C55*$H$6)+(E55*$H$8)","v":0},{"$f":"IFERROR(($K55+$L55)*($G55+$H55*$J55/100)/$I55,0)","v":0},{"$f":"$K55+$L55-$M55","v":0},null,null,null,{"$f":"Constants!$D69","v":0},{"$f":"SUMIF($O$14:$O$103,$P158,$V$14:$V$103)","v":0},{"$f":"(D55*$R$7)+(C55*$R$6)+(E55*$R$8)","v":0},{"$f":"IFERROR(($S55+$T55)*($G55+$H55*$R55/100)/$I55,0)","v":0},{"$f":"$S55+$T55-$U55","v":0}]
["9.c. Sheetflow to Vegetated Filter Strip, A Soils or Compost Amended B/C/D Soils \n(Spec P-FIL-07 & P-FIL-08)",{"$f":"Constants!$B70","v":50},null,null,null,{"$f":"SUMIF($O$14:$O$103,P159,$H$14:$H$103)","v":0},{"$f":"(Constants!$B$2*($G$7*$D56+$G$8*$E56+$C56*$G$6)*3630+$F56)*$B56/100","v":0},{"$f":"(Constants!$B$2*($G$7*$D56+$G$8*$E56+$C56*$G$6)*3630+$F56)*(1-$B56/100)","v":0},{"$f":"+$G56+$H56","v":0},{"$f":"Constants!C70","v":0},{"$f":"SUMIF($O$13:$O$103,P159,$N$13:$N$103)","v":0},{"$f":"(D56*$H$7)+(C56*$H$6)+(E56*$H$8)","v":0},{"$f":"IFERROR(($K56+$L56)*($G56+$H56*$J56/100)/$I56,0)","v":0},{"$f":"$K56+$L56-$M56","v":0},null,null,null,{"$f":"Constants!$D70","v":0},{"$f":"SUMIF($O$14:$O$103,$P159,$V$14:$V$103)","v":0},{"$f":"(D56*$R$7)+(C56*$R$6)+(E56*$R$8)","v":0},{"$f":"IFERROR(($S56+$T56)*($G56+$H56*$R56/100)/$I56,0)","v":0},{"$f":"$S56+$T56-$U56","v":0}]
[]
["10. Regenerative Stormwater Conveyance",null,null,null,null,null,null,null,null,null,null,null,null,null,null,null,null,"10. Regenerative Stormwater Conveyance"]
["10.a. Regenerative Stormwater Conveyance (P-CNV-04)",{"$f":"Constants!$B73","v":0},null,null,null,{"$f":"SUMIF($O$14:$O$103,P160,$H$14:$H$103)","v":0},{"$f":"(Constants!$B$2*($G$7*$D59+$G$8*$E59+$C59*$G$6)*3630+$F59)*$B59/100","v":0},{"$f":"(Constants!$B$2*($G$7*$D59+$G$8*$E59+$C59*$G$6)*3630+$F59)*(1-$B59/100)","v":0},{"$f":"+$G59+$H59","v":0},{"$f":"Constants!C73","v":20},{"$f":"SUMIF($O$13:$O$103,P160,$N$13:$N$103)","v":0},{"$f":"(D59*$H$7)+(C59*$H$6)+(E59*$H$8)","v":0},{"$f":"IFERROR(($K59+$L59)*($G59+$H59*$J59/100)/$I59,0)","v":0},{"$f":"$K59+$L59-$M59","v":0},null,null,null,{"$f":"Constants!$D73","v":25},{"$f":"SUMIF($O$14:$O$103,$P160,$V$14:$V$103)","v":0},{"$f":"(D59*$R$7)+(C59*$R$6)+(E59*$R$8)","v":0},{"$f":"IFERROR(($S59+$T59)*($G59+$H59*$R59/100)/$I59,0)","v":0},{"$f":"$S59+$T59-$U59","v":0}]
["10.b. Regenerative Stormwater Conveyance (P-CNV-04)",{"$f":"Constants!$B74","v":0},null,null,null,{"$f":"SUMIF($O$14:$O$103,P161,$H$14:$H$103)","v":0},{"$f":"(Constants!$B$2*($G$7*$D60+$G$8*$E60+$C60*$G$6)*3630+$F60)*$B60/100","v":0},{"$f":"(Constants!$B$2*($G$7*$D60+$G$8*$E60+$C60*$G$6)*3630+$F60)*(1-$B60/100)","v":0},{"$f":"+$G60+$H60","v":0},{"$f":"Constants!C74","v":40},{"$f":"SUMIF($O$13:$O$103,P161,$N$13:$N$103)","v":0},0,0,{"$f":"$K60+$L60-$M60","v":0},null,null,null,{"$f":"Constants!$D74","v":35},{"$f":"SUMIF($O$14:$O$103,$P161,$V$14:$V$103)","v":0},{"$f":"(D60*$R$7)+(C60*$R$6)+(E60*$R$8)","v":0},{"$f":"IFERROR(($S60+$T60)*($G60+$H60*$R60/100)/$I60,0)","v":0},{"$f":"$S60+$T60-$U60","v":0}]
[]
["11. Tree BMP",null,null,null,null,null,null,null,null,null,null,null,null,null,null,null,null,"11. Tree BMP"]
["11.a. Trees over Pervious, A/B (P-FIL-09)",{"$f":"Constants!$B77","v":16},null,null,null,{"$f":"SUMIF($O$14:$O$103,P162,$H$14:$H$103)","v":0},{"$f":"(Constants!$B$2*($G$7*$D63+$G$8*$E63+$C63*$G$6)*3630+$F63)*$B63/100","v":0},{"$f":"(Constants!$B$2*($G$7*$D63+$G$8*$E63+$C63*$G$6)*3630+$F63)*(1-$B63/100)","v":0},{"$f":"+$G63+$H63","v":0},{"$f":"Constants!C77","v":0},{"$f":"SUMIF($O$13:$O$103,P162,$N$13:$N$103)","v":0},{"$f":"(D63*$H$7)+(C63*$H$6)+(E63*$H$8)","v":0},{"$f":"IFERROR(($K63+$L63)*($G63+$H63*$J63/100)/$I63,0)","v":0},{"$f":"$K63+$L63-$M63","v":0},null,null,null,{"$f":"Constants!$D77","v":0},{"$f":"SUMIF($O$14:$O$103,$P162,$V$14:$V$103)","v":0},{"$f":"(D63*$R$7)+(C63*$R$6)+(E63*$R$8)","v":0},{"$f":"IFERROR(($S63+$T63)*($G63+$H63*$R63/100)/$I63,0)","v":0},{"$f":"$S63+$T63-$U63","v":0}]
["11.b. Trees over Pervious, C/D (P-FIL-09)",{"$f":"Constants!$B78","v":12},null,null,null,{"$f":"SUMIF($O$14:$O$103,P163,$H$14:$H$103)","v":0},{"$f":"(Constants!$B$2*($G$7*$D64+$G$8*$E64+$C64*$G$6)*3630+$F64)*$B64/100","v":0},{"$f":"(Constants!$B$2*($G$7*$D64+$G$8*$E64+$C64*$G$6)*3630+$F64)*(1-$B64/100)","v":0},{"$f":"+$G64+$H64","v":0},{"$f":"Constants!C78","v":0},{"$f":"SUMIF($O$13:$O$103,P163,$N$13:$N$103)","v":0},0,{"$f":"IFERROR(($K64+$L64)*($G64+$H64*$J64/100)/$I64,0)","v":0},{"$f":"$K64+$L64-$M64","v":0},null,null,null,{"$f":"Constants!$D78","v":0},{"$f":"SUMIF($O$14:$O$103,$P163,$V$14:$V$103)","v":0},{"$f":"(D64*$R$7)+(C64*$R$6)+(E64*$R$8)","v":0},{"$f":"IFERROR(($S64+$T64)*($G64+$H64*$R64/100)/$I64,0)","v":0},{"$f":"$S64+$T64-$U64","v":0}]
["11.c. Trees over Impervious (P-FIL-09)",{"$f":"Constants!$B79","v":3.5},null,null,null,{"$f":"SUMIF($O$14:$O$103,P164,$H$14:$H$103)","v":0},{"$f":"(Constants!$B$2*($G$7*$D65+$G$8*$E65+$C65*$G$6)*3630+$F65)*$B65/100","v":0},{"$f":"(Constants!$B$2*($G$7*$D65+$G$8*$E65+$C65*$G$6)*3630+$F65)*(1-$B65/100)","v":0},{"$f":"+$G65+$H65","v":0},{"$f":"Constants!C79","v":0},{"$f":"SUMIF($O$13:$O$103,P164,$N$13:$N$103)","v":0},{"$f":"(D65*$H$7)+(C65*$H$6)+(E65*$H$8)","v":0},{"$f":"IFERROR(($K65+$L65)*($G65+$H65*$J65/100)/$I65,0)","v":0},{"$f":"$K65+$L65-$M65","v":0},null,null,null,{"$f":"Constants!$D79","v":0},{"$f":"SUMIF($O$14:$O$103,$P164,$V$14:$V$103)","v":0},{"$f":"(D65*$R$7)+(C65*$R$6)+(E65*$R$8)","v":0},{"$f":"IFERROR(($S65+$T65)*($G65+$H65*$R65/100)/$I65,0)","v":0},{"$f":"$S65+$T65-$U65","v":0}]
[]
[]
[null,null,null,null,"TOTAL IMPERVIOUS COVER TREATED (ac)",{"$f":"SUM(E14:E65)","v":0},"AREA CHECK:",{"$f":"IF(F68>$F$8,\"AREA EXCEEDED!\",\"OK.\")","v":"OK."}]
[null,null,null,null,"TOTAL MIXED OPEN TREATED (ac)",{"$f":"SUM(C14:C65)","v":0},"AREA CHECK:",{"$f":"IF(F69>$F$6,\"AREA EXCEEDED!\",\"OK.\")","v":"OK."}]
[null,null,null,null,"TOTAL MANAGED TURF AREA TREATED (ac)",{"$f":"SUM(D33:D65)","v":0},"AREA CHECK:",{"$f":"IF(F70>$F$7,\"AREA EXCEEDED!\",\"OK.\")","v":"OK."}]
[null,null,null,null,"TOTAL RUNOFF REDUCTION IN D.A. B (ft3)",{"$f":"IFERROR(SUM($G$14:$G$65),0)","v":0}]
[]
[null,null,null,null,null,null,null,"TOTAL PHOSPHORUS AVAILABLE FOR REMOVAL IN D.A. B (lb/yr)",{"$f":"$N$8","v":0},null,null,null,null,null,null,null,null,null,null,null,null,"TOTAL RUNOFF REDUCTION IN D.A. B (ft3)",{"$f":"F71","v":0}]
[null,null,null,null,null,null,null,"TOTAL PHOSPHORUS REMOVED WITH RUNOFF REDUCTION PRACTICES IN D.A. B (lb/yr)",{"$f":"IFERROR(SUM(M14:M65),0)","v":0},null,null,null,null,null,null,null,null,null,null,null,null,"NITROGEN REMOVED WITH RUNOFF REDUCTION PRACTICES IN D.A. B (lb/yr)",{"$f":"SUM($U$14:$U$65)","v":0}]
[null,null,null,null,null,null,null,"TOTAL PHOSPHORUS REMAINING AFTER APPLYING RUNOFF REDUCTION PRACTICES IN D.A. B (lb/yr)",{"$f":"I73-I74","v":0}]
[null,null,null,null,null,null,null,null,null,null,null,null,null,null,null,null,null,null,null,null,null,null,"           SEE WATER QUALITY COMPLIANCE TAB FOR SITE CALCULATIONS (Information Only)"]
[null,null,"SEE WATER QUALITY COMPLIANCE TAB FOR SITE COMPLIANCE CALCULATIONS"]
[]
[]
[]
[]
["12. Wet Swale (no RR)",null,null,null,null,null,null,null,null,null,null,null,null,null,null,null,null,"12. Wet Swale (Coastal Plain) (no RR)"]
["12.a. Wet Swale #1 (P-CNV-03)",{"$f":"Constants!$B82","v":0},null,null,null,{"$f":"SUMIF($O$14:$O$103,P165,$H$14:$H$103)","v":0},{"$f":"(Constants!$B$2*($G$7*$D83+$G$8*$E83+$C83*$G$6)*3630+$F83)*$B83/100","v":0},{"$f":"(Constants!$B$2*($G$7*$D83+$G$8*$E83+$C83*$G$6)*3630+$F83)*(1-$B83/100)","v":0},{"$f":"+$G83+$H83","v":0},{"$f":"Constants!C82","v":20},{"$f":"SUMIF($O$13:$O$103,P165,$N$13:$N$103)","v":0},{"$f":"(D83*$H$7)+(C83*$H$6)+(E83*$H$8)","v":0},{"$f":"IFERROR(($K83+$L83)*($G83+$H83*$J83/100)/$I83,0)","v":0},{"$f":"$K83+$L83-$M83","v":0},null,null,null,{"$f":"Constants!$D82","v":25},{"$f":"SUMIF($O$14:$O$103,$P165,$V$14:$V$103)","v":0},{"$f":"(D83*$R$7)+(C83*$R$6)+(E83*$R$8)","v":0},{"$f":"IFERROR(($S83+$T83)*($G83+$H83*$R83/100)/$I83,0)","v":0},{"$f":"$S83+$T83-$U83","v":0}]
["12.b. Wet Swale #2 (P-CNV-03)",{"$f":"Constants!$B83","v":0},null,null,null,{"$f":"SUMIF($O$14:$O$103,P166,$H$14:$H$103)","v":0},{"$f":"(Constants!$B$2*($G$7*$D84+$G$8*$E84+$C84*$G$6)*3630+$F84)*$B84/100","v":0},{"$f":"(Constants!$B$2*($G$7*$D84+$G$8*$E84+$C84*$G$6)*3630+$F84)*(1-$B84/100)","v":0},{"$f":"+$G84+$H84","v":0},{"$f":"Constants!C83","v":40},{"$f":"SUMIF($O$13:$O$103,P166,$N$13:$N$103)","v":0},{"$f":"(D84*$H$7)+(C84*$H$6)+(E84*$H$8)","v":0},{"$f":"IFERROR(($K84+$L84)*($G84+$H84*$J84/100)/$I84,0)","v":0},{"$f":"$K84+$L84-$M84","v":0},null,null,null,{"$f":"Constants!$D83","v":35},{"$f":"SUMIF($O$14:$O$103,$P166,$V$14:$V$103)","v":0},{"$f":"(D84*$R$7)+(C84*$R$6)+(E84*$R$8)","v":0},{"$f":"IFERROR(($S84+$T84)*($G84+$H84*$R84/100)/$I84,0)","v":0},{"$f":"$S84+$T84-$U84","v":0}]
[]
["13.  Filtering Practices (no RR)",null,null,null,null,null,null,null,null,null,null,null,null,null,null,null,null,"13.  Filtering Practices (no RR)"]
["13.a.Filtering Practice #1 (P-FIL-06)",{"$f":"Constants!$B86","v":0},null,null,null,{"$f":"SUMIF($O$14:$O$103,P167,$H$14:$H$103)","v":0},{"$f":"(Constants!$B$2*($G$7*$D87+$G$8*$E87+$C87*$G$6)*3630+$F87)*$B87/100","v":0},{"$f":"(Constants!$B$2*($G$7*$D87+$G$8*$E87+$C87*$G$6)*3630+$F87)*(1-$B87/100)","v":0},{"$f":"+$G87+$H87","v":0},{"$f":"Constants!C86","v":60},{"$f":"SUMIF($O$13:$O$103,P167,$N$13:$N$103)","v":0},{"$f":"(D87*$H$7)+(C87*$H$6)+(E87*$H$8)","v":0},{"$f":"IFERROR(($K87+$L87)*($G87+$H87*$J87/100)/$I87,0)","v":0},{"$f":"$K87+$L87-$M87","v":0},null,null,null,{"$f":"Constants!$D86","v":30},{"$f":"SUMIF($O$14:$O$103,$P167,$V$14:$V$103)","v":0},{"$f":"(D87*$R$7)+(C87*$R$6)+(E87*$R$8)","v":0},{"$f":"IFERROR(($S87+$T87)*($G87+$H87*$R87/100)/$I87,0)","v":0},{"$f":"$S87+$T87-$U87","v":0}]
["13.b. Filtering Practice #2 (P-FIL-06)",{"$f":"Constants!$B87","v":0},null,null,null,{"$f":"SUMIF($O$14:$O$103,P168,$H$14:$H$103)","v":0},{"$f":"(Constants!$B$2*($G$7*$D88+$G$8*$E88+$C88*$G$6)*3630+$F88)*$B88/100","v":0},{"$f":"(Constants!$B$2*($G$7*$D88+$G$8*$E88+$C88*$G$6)*3630+$F88)*(1-$B88/100)","v":0},{"$f":"+$G88+$H88","v":0},{"$f":"Constants!C87","v":65},{"$f":"SUMIF($O$13:$O$103,P168,$N$13:$N$103)","v":0},{"$f":"(D88*$H$7)+(C88*$H$6)+(E88*$H$8)","v":0},{"$f":"IFERROR(($K88+$L88)*($G88+$H88*$J88/100)/$I88,0)","v":0},{"$f":"$K88+$L88-$M88","v":0},null,null,null,{"$f":"Constants!$D87","v":45},{"$f":"SUMIF($O$14:$O$103,$P168,$V$14:$V$103)","v":0},{"$f":"(D88*$R$7)+(C88*$R$6)+(E88*$R$8)","v":0},{"$f":"IFERROR(($S88+$T88)*($G88+$H88*$R88/100)/$I88,0)","v":0},{"$f":"$S88+$T88-$U88","v":0}]
[]
["14. Constructed Wetland (no RR)",null,null,null,null,null,null,null,null,null,null,null,null,null,null,null,null,"14. Constructed Wetland (no RR)"]
["14.a.Constructed Wetland #1 (P-BAS-01)",{"$f":"Constants!$B90","v":0},null,null,null,{"$f":"SUMIF($O$14:$O$103,P169,$H$14:$H$103)","v":0},{"$f":"(Constants!$B$2*($G$7*$D91+$G$8*$E91+$C91*$G$6)*3630+$F91)*$B91/100","v":0},{"$f":"(Constants!$B$2*($G$7*$D91+$G$8*$E91+$C91*$G$6)*3630+$F91)*(1-$B91/100)","v":0},{"$f":"+$G91+$H91","v":0},{"$f":"Constants!C90","v":50},{"$f":"SUMIF($O$13:$O$103,P169,$N$13:$N$103)","v":0},{"$f":"(D91*$H$7)+(C91*$H$6)+(E91*$H$8)","v":0},{"$f":"IFERROR(($K91+$L91)*($G91+$H91*$J91/100)/$I91,0)","v":0},{"$f":"$K91+$L91-$M91","v":0},null,null,null,{"$f":"Constants!$D90","v":25},{"$f":"SUMIF($O$14:$O$103,$P169,$V$14:$V$103)","v":0},{"$f":"(D91*$R$7)+(C91*$R$6)+(E91*$R$8)","v":0},{"$f":"IFERROR(($S91+$T91)*($G91+$H91*$R91/100)/$I91,0)","v":0},{"$f":"$S91+$T91-$U91","v":0}]
["14.b. Constructed Wetland #2 (P-BAS-01)",{"$f":"Constants!$B91","v":0},null,null,null,{"$f":"SUMIF($O$14:$O$103,P170,$H$14:$H$103)","v":0},{"$f":"(Constants!$B$2*($G$7*$D92+$G$8*$E92+$C92*$G$6)*3630+$F92)*$B92/100","v":0},{"$f":"(Constants!$B$2*($G$7*$D92+$G$8*$E92+$C92*$G$6)*3630+$F92)*(1-$B92/100)","v":0},{"$f":"+$G92+$H92","v":0},{"$f":"Constants!C91","v":75},{"$f":"SUMIF($O$13:$O$103,P170,$N$13:$N$103)","v":0},{"$f":"(D92*$H$7)+(C92*$H$6)+(E92*$H$8)","v":0},{"$f":"IFERROR(($K92+$L92)*($G92+$H92*$J92/100)/$I92,0)","v":0},{"$f":"$K92+$L92-$M92","v":0},null,null,null,{"$f":"Constants!$D91","v":55},{"$f":"SUMIF($O$14:$O$103,$P170,$V$14:$V$103)","v":0},{"$f":"(D92*$R$7)+(C92*$R$6)+(E92*$R$8)","v":0},{"$f":"IFERROR(($S92+$T92)*($G92+$H92*$R92/100)/$I92,0)","v":0},{"$f":"$S92+$T92-$U92","v":0}]
[]
["15. Wet Ponds (no RR)",null,null,null,null,null,null,null,null,null,null,null,null,null,null,null,null,"15. Wet Ponds (no RR)"]
["15.a. Wet Pond #1 (P-BAS-02)",{"$f":"Constants!$B94","v":0},null,null,null,{"$f":"SUMIF($O$14:$O$103,P171,$H$14:$H$103)","v":0},{"$f":"(Constants!$B$2*($G$7*$D95+$G$8*$E95+$C95*$G$6)*3630+$F95)*$B95/100","v":0},{"$f":"(Constants!$B$2*($G$7*$D95+$G$8*$E95+$C95*$G$6)*3630+$F95)*(1-$B95/100)","v":0},{"$f":"+$G95+$H95","v":0},{"$f":"Constants!C94","v":50},{"$f":"SUMIF($O$13:$O$103,P171,$N$13:$N$103)","v":0},{"$f":"(D95*$H$7)+(C95*$H$6)+(E95*$H$8)","v":0},{"$f":"IFERROR(($K95+$L95)*($G95+$H95*$J95/100)/$I95,0)","v":0},{"$f":"$K95+$L95-$M95","v":0},null,null,null,{"$f":"Constants!$D94","v":30},{"$f":"SUMIF($O$14:$O$103,$P171,$V$14:$V$103)","v":0},{"$f":"(D95*$R$7)+(C95*$R$6)+(E95*$R$8)","v":0},{"$f":"IFERROR(($S95+$T95)*($G95+$H95*$R95/100)/$I95,0)","v":0},{"$f":"$S95+$T95-$U95","v":0}]
["15.b. Wet Pond #1 (Coastal Plain) (P-BAS-02)",{"$f":"Constants!$B95","v":0},null,null,null,{"$f":"SUMIF($O$14:$O$103,P172,$H$14:$H$103)","v":0},{"$f":"(Constants!$B$2*($G$7*$D96+$G$8*$E96+$C96*$G$6)*3630+$F96)*$B96/100","v":0},{"$f":"(Constants!$B$2*($G$7*$D96+$G$8*$E96+$C96*$G$6)*3630+$F96)*(1-$B96/100)","v":0},{"$f":"+$G96+$H96","v":0},{"$f":"Constants!C95","v":45},{"$f":"SUMIF($O$13:$O$103,P172,$N$13:$N$103)","v":0},{"$f":"(D96*$H$7)+(C96*$H$6)+(E96*$H$8)","v":0},{"$f":"IFERROR(($K96+$L96)*($G96+$H96*$J96/100)/$I96,0)","v":0},{"$f":"$K96+$L96-$M96","v":0},null,null,null,{"$f":"Constants!$D95","v":20},{"$f":"SUMIF($O$14:$O$103,$P172,$V$14:$V$103)","v":0},{"$f":"(D96*$R$7)+(C96*$R$6)+(E96*$R$8)","v":0},{"$f":"IFERROR(($S96+$T96)*($G96+$H96*$R96/100)/$I96,0)","v":0},{"$f":"$S96+$T96-$U96","v":0}]
["15.c. Wet Pond #2 (P-BAS-02)",{"$f":"Constants!$B96","v":0},null,null,null,{"$f":"SUMIF($O$14:$O$103,P173,$H$14:$H$103)","v":0},{"$f":"(Constants!$B$2*($G$7*$D97+$G$8*$E97+$C97*$G$6)*3630+$F97)*$B97/100","v":0},{"$f":"(Constants!$B$2*($G$7*$D97+$G$8*$E97+$C97*$G$6)*3630+$F97)*(1-$B97/100)","v":0},{"$f":"+$G97+$H97","v":0},{"$f":"Constants!C96","v":75},{"$f":"SUMIF($O$13:$O$103,P173,$N$13:$N$103)","v":0},{"$f":"(D97*$H$7)+(C97*$H$6)+(E97*$H$8)","v":0},{"$f":"IFERROR(($K97+$L97)*($G97+$H97*$J97/100)/$I97,0)","v":0},{"$f":"$K97+$L97-$M97","v":0},null,null,null,{"$f":"Constants!$D96","v":40},{"$f":"SUMIF($O$14:$O$103,$P173,$V$14:$V$103)","v":0},{"$f":"(D97*$R$7)+(C97*$R$6)+(E97*$R$8)","v":0},{"$f":"IFERROR(($S97+$T97)*($G97+$H97*$R97/100)/$I97,0)","v":0},{"$f":"$S97+$T97-$U97","v":0}]
["15.d. Wet Pond #2 (Coastal Plain) (P-BAS-02)",{"$f":"Constants!$B97","v":0},null,null,null,{"$f":"SUMIF($O$14:$O$103,P174,$H$14:$H$103)","v":0},{"$f":"(Constants!$B$2*($G$7*$D98+$G$8*$E98+$C98*$G$6)*3630+$F98)*$B98/100","v":0},{"$f":"(Constants!$B$2*($G$7*$D98+$G$8*$E98+$C98*$G$6)*3630+$F98)*(1-$B98/100)","v":0},{"$f":"+$G98+$H98","v":0},{"$f":"Constants!C97","v":65},{"$f":"SUMIF($O$13:$O$103,P174,$N$13:$N$103)","v":0},{"$f":"(D98*$H$7)+(C98*$H$6)+(E98*$H$8)","v":0},{"$f":"IFERROR(($K98+$L98)*($G98+$H98*$J98/100)/$I98,0)","v":0},{"$f":"$K98+$L98-$M98","v":0},null,null,null,{"$f":"Constants!$D97","v":30},{"$f":"SUMIF($O$14:$O$103,$P174,$V$14:$V$103)","v":0},{"$f":"(D98*$R$7)+(C98*$R$6)+(E98*$R$8)","v":0},{"$f":"IFERROR(($S98+$T98)*($G98+$H98*$R98/100)/$I98,0)","v":0},{"$f":"$S98+$T98-$U98","v":0}]
[]
["16. Manufactured Treatment Devices (no RR)",null,null,null,null,null,null,null,null,null,null,null,null,null,null,null,null,"16. Manufactured BMP (no RR)"]
["16.a. Manufactured Treatment Device-Hydrodynamic",{"$f":"Constants!$B100","v":0},null,null,null,{"$f":"SUMIF($O$14:$O$103,P175,$H$14:$H$103)","v":0},{"$f":"(Constants!$B$2*($G$7*$D101+$G$8*$E101+$C101*$G$6)*3630+$F101)*$B101/100","v":0},{"$f":"(Constants!$B$2*($G$7*$D101+$G$8*$E101+$C101*$G$6)*3630+$F101)*(1-$B101/100)","v":0},{"$f":"+$G101+$H101","v":0},20,{"$f":"SUMIF($O$13:$O$103,P175,$N$13:$N$103)","v":0},{"$f":"(D101*$H$7)+(C101*$H$6)+(E101*$H$8)","v":0},{"$f":"IFERROR(($K101+$L101)*($G101+$H101*$J101/100)/$I101,0)","v":0},{"$f":"$K101+$L101-$M101","v":0},null,null,null,0,{"$f":"SUMIF($O$14:$O$103,$P175,$V$14:$V$103)","v":0},{"$f":"(D101*$R$7)+(C101*$R$6)+(E101*$R$8)","v":0},{"$f":"IFERROR(($S101+$T101)*($G101+$H101*$R101/100)/$I101,0)","v":0},{"$f":"$S101+$T101-$U101","v":0}]
["16.b. Manufactured Treatment Device-Filtering",{"$f":"Constants!$B101","v":0},null,null,null,{"$f":"SUMIF($O$14:$O$103,P176,$H$14:$H$103)","v":0},{"$f":"(Constants!$B$2*($G$7*$D102+$G$8*$E102+$C102*$G$6)*3630+$F102)*$B102/100","v":0},{"$f":"(Constants!$B$2*($G$7*$D102+$G$8*$E102+$C102*$G$6)*3630+$F102)*(1-$B102/100)","v":0},{"$f":"+$G102+$H102","v":0},20,{"$f":"SUMIF($O$13:$O$103,P176,$N$13:$N$103)","v":0},{"$f":"(D102*$H$7)+(C102*$H$6)+(E102*$H$8)","v":0},{"$f":"IFERROR(($K102+$L102)*($G102+$H102*$J102/100)/$I102,0)","v":0},{"$f":"$K102+$L102-$M102","v":0},null,null,null,0,{"$f":"SUMIF($O$14:$O$103,$P176,$V$14:$V$103)","v":0},{"$f":"(D102*$R$7)+(C102*$R$6)+(E102*$R$8)","v":0},{"$f":"IFERROR(($S102+$T102)*($G102+$H102*$R102/100)/$I102,0)","v":0},{"$f":"$S102+$T102-$U102","v":0}]
["16.c. Manufactured Treatment Device-Generic",{"$f":"Constants!$B102","v":0},null,null,null,{"$f":"SUMIF($O$14:$O$103,P177,$H$14:$H$103)","v":0},{"$f":"(Constants!$B$2*($G$7*$D103+$G$8*$E103+$C103*$G$6)*3630+$F103)*$B103/100","v":0},{"$f":"(Constants!$B$2*($G$7*$D103+$G$8*$E103+$C103*$G$6)*3630+$F103)*(1-$B103/100)","v":0},{"$f":"+$G103+$H103","v":0},20,{"$f":"SUMIF($O$13:$O$103,P177,$N$13:$N$103)","v":0},{"$f":"(D103*$H$7)+(C103*$H$6)+(E103*$H$8)","v":0},{"$f":"IFERROR(($K103+$L103)*($G103+$H103*$J103/100)/$I103,0)","v":0},{"$f":"$K103+$L103-$M103","v":0},null,null,null,0,{"$f":"SUMIF($O$14:$O$103,$P177,$V$14:$V$103)","v":0},{"$f":"(D103*$R$7)+(C103*$R$6)+(E103*$R$8)","v":0},{"$f":"IFERROR(($S103+$T103)*($G103+$H103*$R103/100)/$I103,0)","v":0},{"$f":"$S103+$T103-$U103","v":0}]
[]
[]
[]
[null,null,null,null,"TOTAL IMPERVIOUS COVER TREATED (ac)",{"$f":"SUM($E$14:$E$103)","v":0},"AREA CHECK:",{"$f":"IF($F$107>$F$8,\"AREA EXCEEDED!\",\"OK.\")","v":"OK."}]
[null,null,null,null,"TOTAL MIXED OPEN TREATED (ac)",{"$f":"SUM($C$14:$C$103)","v":0},"AREA CHECK:",{"$f":"IF($F$108>$F$6,\"AREA EXCEEDED!\",\"OK.\")","v":"OK."}]
[null,null,null,null,"TOTAL MANAGED TURF AREA TREATED (ac)",{"$f":"SUM($D$14:$D$103)","v":0},"AREA CHECK:",{"$f":"IF($F$109>$F$7,\"AREA EXCEEDED!\",\"OK.\")","v":"OK."}]
[]
[null,null,null,null,null,null,null,"TOTAL PHOSPHORUS REMOVAL REQUIRED ON SITE (lb/yr)",{"$f":"IF(Site!$E$21=\"Check Areas!\",\"ERROR - \",Site!$E$21)","v":0},{"$f":"IF(I111=\"ERROR - \",\"Site Data Tab\",\"\")","v":""}]
[]
[null,null,null,null,null,null,null,"TOTAL PHOSPHORUS AVAILABLE FOR REMOVAL IN D.A. B (lb/yr)",{"$f":"$N$8","v":0}]
[null,null,null,null,null,null,null,"TOTAL PHOSPHORUS REMOVED WITHOUT RUNOFF REDUCTION PRACTICES IN D.A. B (lb/yr)",{"$f":"SUM($M$83:$M$103)","v":0}]
[null,null,null,null,null,null,null,"TOTAL PHOSPHORUS REMOVED WITH RUNOFF REDUCTION PRACTICES IN D.A. B (lb/yr)",{"$f":"$I$74","v":0}]
[null,null,null,null,null,null,null,"TOTAL PHOSPHORUS LOAD REDUCTION ACHIEVED IN D.A. B (lb/yr)",{"$f":"$I$114+$I$115","v":0}]
[null,null,null,null,null,null,null,"TOTAL PHOSPHORUS REMAINING AFTER APPLYING BMP LOAD REDUCTIONS IN D.A. B (lb/yr)",{"$f":"$I$113-$I$116","v":0}]
[]
[null,null,"SEE WATER QUALITY COMPLIANCE TAB FOR SITE COMPLIANCE CALCULATIONS"]
[]
[null,null,null,null,null,null,null,"NITROGEN REMOVED WITH RUNOFF REDUCTION PRACTICES IN D.A. B (lb/yr)",{"$f":"IFERROR(SUM($U$14:$U$65),0)","v":0}]
[null,null,null,null,null,null,null,"NITROGEN REMOVED WITHOUT RUNOFF REDUCTION PRACTICES IN D.A. B (lb/yr)",{"$f":"SUM($U$83:$U$103)","v":0}]
[null,null,null,null,null,null,null,"TOTAL NITROGEN REMOVED IN D.A. B (lb/yr)",{"$f":"$I$121+$I$122","v":0}]
[]
[]
[]
[]
[]
[]
[]
[null,null,"Downstream Practices - Dropdown selections for each applicable BMP"]
[]
["Options for 1. Green Roof",null,"Options for 2. Impervious Surface Disconnection",null,"Options for 3a. Pervious Parking, A/B Soils",null,"Options for 4a. Grass Channels, A/B Soils",null,null,"Options for 4b. Grass Channels, C/D Soils"]
[null,null,null,null,null,null,null,null,null,null,null,"Options for 4.c. Grass Channel Compost Amended Soils",null,null,null,"Master Downstream BMP Reference List"]
[{"$f":"P135","v":"None"},null,{"$f":"P135","v":"None"},null,{"$f":"P135","v":"None"},null,{"$f":"P135","v":"None"},null,null,{"$f":"P135","v":"None"},null,null,null,null,null,"None"]
["2.a. Simple Disconnection to A/B Soils",null,{"$f":"P146","v":"4.a. Grass Channel A/B Soils"},null,{"$f":"P146","v":"4.a. Grass Channel A/B Soils"},null,{"$f":"P147","v":"4.b. Grass Channel C/D Soils"},null,null,{"$f":"P146","v":"4.a. Grass Channel A/B Soils"},null,{"$f":"P135","v":"None"},null,null,null,"2.a. Simple Disconnection to A/B Soils"]
["2.b. Simple Disconnection to C/D Soils",null,"4.b. Grass Channel C/D Soils",null,"4.b. Grass Channel C/D Soils",null,"4.c. Grass Channel Compost Amended Soils",null,null,{"$f":"P148","v":"4.c. Grass Channel Compost Amended Soils"},null,{"$f":"P146","v":"4.a. Grass Channel A/B Soils"},null,null,null,"2.b. Simple Disconnection to C/D Soils"]
["2.c. To Soil Amended Filter Path",null,"4.c. Grass Channel Compost Amended Soils",null,"4.c. Grass Channel Compost Amended Soils",null,"5.a. Dry Swale #1",null,null,"5.a. Dry Swale #1",null,{"$f":"P147","v":"4.b. Grass Channel C/D Soils"},null,null,null,"2.c. To Soil Amended Filter Path"]
["2.d. To Dry Well/French Drain #1 (Micro-Infiltration #1)",null,"5.a. Dry Swale #1",null,"5.a. Dry Swale #1",null,"5.b. Dry Swale #2",null,null,"5.b. Dry Swale #2",null,{"$f":"P149","v":"5.a. Dry Swale #1"},null,null,null,"2.d. To Dry Well/French Drain #1 (Micro-Infiltration #1)"]
["2.e. To Dry Well/French Drain #2 (Micro-Infiltration. #2)",null,"5.b. Dry Swale #2",null,"5.b. Dry Swale #2",null,"6.a. Bioretention #1",null,null,"6.a. Bioretention #1",null,"5.b. Dry Swale #2",null,null,null,"2.e. To Dry Well/French Drain #2 (Micro-Infiltration. #2)"]
["2.f. To Rain Garden #1 (Micro-Bioretention #1)",null,"6.a. Bioretention #1",null,"6.a. Bioretention #1",null,"6.b. Bioretention #2",null,null,"6.b. Bioretention #2",null,"6.a. Bioretention #1",null,null,null,"2.f. To Rain Garden #1 (Micro-Bioretention #1)"]
["2.g. To Rain Garden #2 (Micro-Bioretention #2)",null,"6.b. Bioretention #2",null,"6.b. Bioretention #2",null,"7.a. Infiltration #1",null,null,"7.a. Infiltration #1",null,"6.b. Bioretention #2",null,null,null,"2.g. To Rain Garden #2 (Micro-Bioretention #2)"]
["2.h. To Train Barrel, Rain Tank, or Cistern",null,"7.a. Infiltration #1",null,"7.a. Infiltration #1",null,"7.b. Infiltration #2",null,null,"7.b. Infiltration #2",null,"7.a. Infiltration #1",null,null,null,"2.h. To Train Barrel, Rain Tank, or Cistern"]
["2.i. To Stormwater Planter (Urban Bioretention)",null,"7.b. Infiltration #2",null,"7.b. Infiltration #2",null,"8.a. ED #1",null,null,"8.a. ED #1",null,"7.b. Infiltration #2",null,null,null,"2.i. To Stormwater Planter (Urban Bioretention)"]
["3.a. Permeable Pavement #1",null,"8.a. ED #1",null,"8.a. ED #1",null,"8.b. ED #2",null,null,"8.b. ED #2",null,"8.a. ED #1",null,null,null,"3.a. Permeable Pavement #1"]
["4.a. Grass Channel A/B Soils",null,"8.b. ED #2",null,"8.b. ED #2",null,"9.a. Sheetflow to A/B Soil Conservation Area ",null,null,"9.a. Sheetflow to A/B Soil Conservation Area ",null,"8.b. ED #2",null,null,null,"4.a. Grass Channel A/B Soils"]
["4.b. Grass Channel C/D Soils",null,"9.a. Sheetflow to A/B Soil Conservation Area ",null,"9.a. Sheetflow to A/B Soil Conservation Area ",null,"9.b. Sheetflow to C/D Soil Conservation Area",null,null,"9.b. Sheetflow to C/D Soil Conservation Area",null,"9.a. Sheetflow to A/B Soil Conservation Area ",null,null,null,"4.b. Grass Channel C/D Soils"]
["4.c. Grass Channel Compost Amended Soils",null,"9.b. Sheetflow to C/D Soil Conservation Area",null,"9.b. Sheetflow to C/D Soil Conservation Area",null,"9.c. Sheetflow to Vegetated Filter Strip",null,null,"9.c. Sheetflow to Vegetated Filter Strip",null,"9.b. Sheetflow to C/D Soil Conservation Area",null,null,null,"4.c. Grass Channel Compost Amended Soils"]
["5.a. Dry Swale #1",null,"9.c. Sheetflow to Vegetated Filter Strip",null,"9.c. Sheetflow to Vegetated Filter Strip",null,"10.a. Regenerative Stormwater Conveyance #1",null,null,"10.a. Regenerative Stormwater Conveyance #1",null,"9.c. Sheetflow to Vegetated Filter Strip",null,null,null,"5.a. Dry Swale #1"]
["5.b. Dry Swale #2",null,"10.a. Regenerative Stormwater Conveyance #1",null,"10.a. Regenerative Stormwater Conveyance #1",null,"10.b. Regenerative Stormwater Conveyance #2",null,null,"10.b. Regenerative Stormwater Conveyance #2",null,"10.a. Regenerative Stormwater Conveyance #1",null,null,null,"5.b. Dry Swale #2"]
["6.a. Bioretention #1",null,"10.b. Regenerative Stormwater Conveyance #2",null,"10.b. Regenerative Stormwater Conveyance #2",null,{"$f":"P165","v":"12.a. Wet Swale #1"},null,null,{"$f":"P165","v":"12.a. Wet Swale #1"},null,"10.b. Regenerative Stormwater Conveyance #2",null,null,null,"6.a. Bioretention #1"]
["6.b. Bioretention #2",null,{"$f":"P165","v":"12.a. Wet Swale #1"},null,{"$f":"P165","v":"12.a. Wet Swale #1"},null,"12.b. Wet Swale #2",null,null,"12.b. Wet Swale #2",null,{"$f":"P165","v":"12.a. Wet Swale #1"},null,null,null,"6.b. Bioretention #2"]
["7.a. Infiltration #1",null,"12.b. Wet Swale #2",null,"12.b. Wet Swale #2",null,"13.a. Filtering Practice #1",null,null,"13.a. Filtering Practice #1",null,"12.b. Wet Swale #2",null,null,null,"7.a. Infiltration #1"]
["7.b. Infiltration #2",null,"13.a. Filtering Practice #1",null,"13.a. Filtering Practice #1",null,"13.b. Filtering Practice #2",null,null,"13.b. Filtering Practice #2",null,"13.a. Filtering Practice #1",null,null,null,"7.b. Infiltration #2"]
["8.a. ED #1",null,"13.b. Filtering Practice #2",null,"13.b. Filtering Practice #2",null,"14.a. Constructed Wetland #1",null,null,"14.a. Constructed Wetland #1",null,"13.b. Filtering Practice #2",null,null,null,"8.a. ED #1"]
["8.b. ED #2",null,"14.a. Constructed Wetland #1",null,"14.a. Constructed Wetland #1",null,"14.b. Constructed Wetland #2",null,null,"14.b. Constructed Wetland #2",null,"14.a. Constructed Wetland #1",null,null,null,"8.b. ED #2"]
["9.a. Sheetflow to A/B Soil Conservation Area ",null,"14.b. Constructed Wetland #2",null,"14.b. Constructed Wetland #2",null,"15.a. Wet Pond #1",null,null,"15.a. Wet Pond #1",null,"14.b. Constructed Wetland #2",null,null,null,"9.a. Sheetflow to A/B Soil Conservation Area "]
["9.b. Sheetflow to C/D Soil Conservation Area",null,"15.a. Wet Pond #1",null,"15.a. Wet Pond #1",null,"15.b. Wet Pond #1 (Coastal Plain)",null,null,"15.b. Wet Pond #1 (Coastal Plain)",null,"15.a. Wet Pond #1",null,null,null,"9.b. Sheetflow to C/D Soil Conservation Area"]
["9.c. Sheetflow to Vegetated Filter Strip",null,"15.b. Wet Pond #1 (Coastal Plain)",null,"15.b. Wet Pond #1 (Coastal Plain)",null,"15.c. Wet Pond #2",null,null,"15.c. Wet Pond #2",null,"15.b. Wet Pond #1 (Coastal Plain)",null,null,null,"9.c. Sheetflow to Vegetated Filter Strip"]
["10.a. Regenerative Stormwater Conveyance #1",null,"15.c. Wet Pond #2",null,"15.c. Wet Pond #2",null,"15.d. Wet Pond #2 (Coastal Plain)",null,null,"15.d. Wet Pond #2 (Coastal Plain)",null,"15.c. Wet Pond #2",null,null,null,"10.a. Regenerative Stormwater Conveyance #1"]
["10.b. Regenerative Stormwater Conveyance #2",null,"15.d. Wet Pond #2 (Coastal Plain)",null,"15.d. Wet Pond #2 (Coastal Plain)",null,"16.a. MTD - Hydrodynamic",null,null,"16.a. MTD - Hydrodynamic",null,"15.d. Wet Pond #2 (Coastal Plain)",null,null,null,"10.b. Regenerative Stormwater Conveyance #2"]
[{"$f":"P165","v":"12.a. Wet Swale #1"},null,"16.a. MTD - Hydrodynamic",null,"16.a. MTD - Hydrodynamic",null,"16.b. MTD - Filtering",null,null,"16.b. MTD - Filtering",null,"16.a. MTD - Hydrodynamic",null,null,null,"11.a. Trees over Pervious, A/B"]
["12.b. Wet Swale #2",null,"16.b. MTD - Filtering",null,"16.b. MTD - Filtering",null,"16.c. MTD - Generic",null,null,"16.c. MTD - Generic",null,"16.b. MTD - Filtering",null,null,null,"11.b. Trees over Pervious, B/C"]
["13.a. Filtering Practice #1",null,"16.c. MTD - Generic",null,"16.c. MTD - Generic",null,null,null,null,null,null,"16.c. MTD - Generic",null,null,null,"11.c. Trees over Impervious"]
["13.b. Filtering Practice #2",null,null,null,null,null,null,null,null,null,null,null,null,null,null,"12.a. Wet Swale #1"]
["14.a. Constructed Wetland #1",null,null,null,null,null,null,null,null,null,null,null,null,null,null,"12.b. Wet Swale #2"]
["14.b. Constructed Wetland #2",null,null,null,null,null,null,null,null,null,null,null,null,null,null,"13.a. Filtering Practice #1"]
["15.a. Wet Pond #1",null,null,null,null,null,null,null,null,null,null,null,null,null,null,"13.b. Filtering Practice #2"]
["15.b. Wet Pond #1 (Coastal Plain)",null,null,null,null,null,null,null,null,null,null,null,null,null,null,"14.a. Constructed Wetland #1"]
["15.c. Wet Pond #2",null,null,null,null,null,null,null,null,null,null,null,null,null,null,"14.b. Constructed Wetland #2"]
["15.d. Wet Pond #2 (Coastal Plain)",null,null,null,null,null,null,null,null,null,null,null,null,null,null,"15.a. Wet Pond #1"]
["16.a. MTD - Hydrodynamic",null,null,null,null,null,null,null,null,null,null,null,null,null,null,"15.b. Wet Pond #1 (Coastal Plain)"]
["16.b. MTD - Filtering",null,null,null,null,null,null,null,null,null,null,null,null,null,null,"15.c. Wet Pond #2"]
["16.c. MTD - Generic",null,null,null,null,null,null,null,null,null,null,null,null,null,null,"15.d. Wet Pond #2 (Coastal Plain)"]
[null,null,null,null,null,null,null,null,null,null,null,null,null,null,null,"16.a. MTD - Hydrodynamic"]
["Options for 5a. Dry Swale #1",null,"Options for 5b. Dry Swale #2",null,"Options for 6a. Bioretention #1",null,"Options for 6b. Bioretention #2",null,null,"Options for 7a. Infiltration #1",null,"Options for 7b. Infiltration #2",null,null,null,"16.b. MTD - Filtering"]
[null,null,null,null,null,null,null,null,null,null,null,null,null,null,null,"16.c. MTD - Generic"]
[{"$f":"P135","v":"None"},null,{"$f":"P135","v":"None"},null,{"$f":"P135","v":"None"},null,{"$f":"P135","v":"None"},null,null,{"$f":"P135","v":"None"},null,{"$f":"P135","v":"None"}]
[{"$f":"P146","v":"4.a. Grass Channel A/B Soils"},null,{"$f":"P146","v":"4.a. Grass Channel A/B Soils"},null,{"$f":"P146","v":"4.a. Grass Channel A/B Soils"},null,{"$f":"P146","v":"4.a. Grass Channel A/B Soils"},null,null,{"$f":"P146","v":"4.a. Grass Channel A/B Soils"},null,{"$f":"P146","v":"4.a. Grass Channel A/B Soils"}]
[{"$f":"P147","v":"4.b. Grass Channel C/D Soils"},null,{"$f":"P147","v":"4.b. Grass Channel C/D Soils"},null,{"$f":"P147","v":"4.b. Grass Channel C/D Soils"},null,"4.b. Grass Channel C/D Soils",null,null,"4.b. Grass Channel C/D Soils",null,"4.b. Grass Channel C/D Soils"]
[{"$f":"P148","v":"4.c. Grass Channel Compost Amended Soils"},null,{"$f":"P148","v":"4.c. Grass Channel Compost Amended Soils"},null,{"$f":"P148","v":"4.c. Grass Channel Compost Amended Soils"},null,"4.c. Grass Channel Compost Amended Soils",null,null,"4.c. Grass Channel Compost Amended Soils",null,"4.c. Grass Channel Compost Amended Soils"]
[{"$f":"P150","v":"5.b. Dry Swale #2"},null,{"$f":"P149","v":"5.a. Dry Swale #1"},null,{"$f":"P149","v":"5.a. Dry Swale #1"},null,"5.a. Dry Swale #1",null,null,"5.a. Dry Swale #1",null,"5.a. Dry Swale #1"]
["6.a. Bioretention #1",null,{"$f":"P151","v":"6.a. Bioretention #1"},null,{"$f":"P150","v":"5.b. Dry Swale #2"},null,"5.b. Dry Swale #2",null,null,"5.b. Dry Swale #2",null,"5.b. Dry Swale #2"]
["6.b. Bioretention #2",null,"6.b. Bioretention #2",null,{"$f":"P152","v":"6.b. Bioretention #2"},null,"6.a. Bioretention #1",null,null,"6.a. Bioretention #1",null,"6.a. Bioretention #1"]
["7.a. Infiltration #1",null,"7.a. Infiltration #1",null,"7.a. Infiltration #1",null,{"$f":"P153","v":"7.a. Infiltration #1"},null,null,"6.b. Bioretention #2",null,"6.b. Bioretention #2"]
["7.b. Infiltration #2",null,"7.b. Infiltration #2",null,"7.b. Infiltration #2",null,"7.b. Infiltration #2",null,null,{"$f":"P154","v":"7.b. Infiltration #2"},null,"7.a. Infiltration #1"]
["8.a. ED #1",null,"8.a. ED #1",null,"8.a. ED #1",null,"8.a. ED #1",null,null,"8.a. ED #1",null,{"$f":"P155","v":"8.a. ED #1"}]
["8.b. ED #2",null,"8.b. ED #2",null,"8.b. ED #2",null,"8.b. ED #2",null,null,"8.b. ED #2",null,"8.b. ED #2"]
["9.a. Sheetflow to A/B Soil Conservation Area ",null,"9.a. Sheetflow to A/B Soil Conservation Area ",null,"9.a. Sheetflow to A/B Soil Conservation Area ",null,"9.a. Sheetflow to A/B Soil Conservation Area ",null,null,"9.a. Sheetflow to A/B Soil Conservation Area ",null,"9.a. Sheetflow to A/B Soil Conservation Area "]
["9.b. Sheetflow to C/D Soil Conservation Area",null,"9.b. Sheetflow to C/D Soil Conservation Area",null,"9.b. Sheetflow to C/D Soil Conservation Area",null,"9.b. Sheetflow to C/D Soil Conservation Area",null,null,"9.b. Sheetflow to C/D Soil Conservation Area",null,"9.b. Sheetflow to C/D Soil Conservation Area"]
["9.c. Sheetflow to Vegetated Filter Strip",null,"9.c. Sheetflow to Vegetated Filter Strip",null,"9.c. Sheetflow to Vegetated Filter Strip",null,"9.c. Sheetflow to Vegetated Filter Strip",null,null,"9.c. Sheetflow to Vegetated Filter Strip",null,"9.c. Sheetflow to Vegetated Filter Strip"]
["10.a. Regenerative Stormwater Conveyance #1",null,"10.a. Regenerative Stormwater Conveyance #1",null,"10.a. Regenerative Stormwater Conveyance #1",null,"10.a. Regenerative Stormwater Conveyance #1",null,null,"10.a. Regenerative Stormwater Conveyance #1",null,"10.a. Regenerative Stormwater Conveyance #1"]
["10.b. Regenerative Stormwater Conveyance #2",null,"10.b. Regenerative Stormwater Conveyance #2",null,"10.b. Regenerative Stormwater Conveyance #2",null,"10.b. Regenerative Stormwater Conveyance #2",null,null,"10.b. Regenerative Stormwater Conveyance #2",null,"10.b. Regenerative Stormwater Conveyance #2"]
[{"$f":"P165","v":"12.a. Wet Swale #1"},null,{"$f":"P165","v":"12.a. Wet Swale #1"},null,{"$f":"P165","v":"12.a. Wet Swale #1"},null,{"$f":"P165","v":"12.a. Wet Swale #1"},null,null,{"$f":"P165","v":"12.a. Wet Swale #1"},null,{"$f":"P165","v":"12.a. Wet Swale #1"}]
["12.b. Wet Swale #2",null,"12.b. Wet Swale #2",null,"12.b. Wet Swale #2",null,"12.b. Wet Swale #2",null,null,"12.b. Wet Swale #2",null,"12.b. Wet Swale #2"]
["13.a. Filtering Practice #1",null,"13.a. Filtering Practice #1",null,"13.a. Filtering Practice #1",null,"13.a. Filtering Practice #1",null,null,"13.a. Filtering Practice #1",null,"13.a. Filtering Practice #1"]
["13.b. Filtering Practice #2",null,"13.b. Filtering Practice #2",null,"13.b. Filtering Practice #2",null,"13.b. Filtering Practice #2",null,null,"13.b. Filtering Practice #2",null,"13.b. Filtering Practice #2"]
["14.a. Constructed Wetland #1",null,"14.a. Constructed Wetland #1",null,"14.a. Constructed Wetland #1",null,"14.a. Constructed Wetland #1",null,null,"14.a. Constructed Wetland #1",null,"14.a. Constructed Wetland #1"]
["14.b. Constructed Wetland #2",null,"14.b. Constructed Wetland #2",null,"14.b. Constructed Wetland #2",null,"14.b. Constructed Wetland #2",null,null,"14.b. Constructed Wetland #2",null,"14.b. Constructed Wetland #2"]
["15.a. Wet Pond #1",null,"15.a. Wet Pond #1",null,"15.a. Wet Pond #1",null,"15.a. Wet Pond #1",null,null,"15.a. Wet Pond #1",null,"15.a. Wet Pond #1"]
["15.b. Wet Pond #1 (Coastal Plain)",null,"15.b. Wet Pond #1 (Coastal Plain)",null,"15.b. Wet Pond #1 (Coastal Plain)",null,"15.b. Wet Pond #1 (Coastal Plain)",null,null,"15.b. Wet Pond #1 (Coastal Plain)",null,"15.b. Wet Pond #1 (Coastal Plain)"]
["15.c. Wet Pond #2",null,"15.c. Wet Pond #2",null,"15.c. Wet Pond #2",null,"15.c. Wet Pond #2",null,null,"15.c. Wet Pond #2",null,"15.c. Wet Pond #2"]
["15.d. Wet Pond #2 (Coastal Plain)",null,"15.d. Wet Pond #2 (Coastal Plain)",null,"15.d. Wet Pond #2 (Coastal Plain)",null,"15.d. Wet Pond #2 (Coastal Plain)",null,null,"15.d. Wet Pond #2 (Coastal Plain)",null,"15.d. Wet Pond #2 (Coastal Plain)"]
["16.a. MTD - Hydrodynamic",null,"16.a. MTD - Hydrodynamic",null,"16.a. MTD - Hydrodynamic",null,"16.a. MTD - Hydrodynamic",null,null,"16.a. MTD - Hydrodynamic",null,"16.a. MTD - Hydrodynamic"]
["16.b. MTD - Filtering",null,"16.b. MTD - Filtering",null,"16.b. MTD - Filtering",null,"16.b. MTD - Filtering",null,null,"16.b. MTD - Filtering",null,"16.b. MTD - Filtering"]
["16.c. MTD - Generic",null,"16.c. MTD - Generic",null,"16.c. MTD - Generic",null,"16.c. MTD - Generic",null,null,"16.c. MTD - Generic",null,"16.c. MTD - Generic"]
[]
["Options for 8a. Extended Detention #1",null,"Options for 8b. Extended Detention #2",null,"Options for 9 Sheet Flow to Open Space",null,"Options for 9c. Sheet Flow to Filter Strip",null,null,"Options for 10a. Wet Swale #1",null,"Options for 10b. Wet Swale #2"]
[]
[{"$f":"P135","v":"None"},null,{"$f":"P135","v":"None"},null,{"$f":"P135","v":"None"},null,{"$f":"P135","v":"None"},null,null,{"$f":"P135","v":"None"},null,{"$f":"P135","v":"None"}]
[{"$f":"P146","v":"4.a. Grass Channel A/B Soils"},null,{"$f":"P146","v":"4.a. Grass Channel A/B Soils"},null,null,null,{"$f":"P146","v":"4.a. Grass Channel A/B Soils"},null,null,{"$f":"P146","v":"4.a. Grass Channel A/B Soils"},null,{"$f":"P146","v":"4.a. Grass Channel A/B Soils"}]
["4.b. Grass Channel C/D Soils",null,"4.b. Grass Channel C/D Soils",null,null,null,"4.b. Grass Channel C/D Soils",null,null,"4.b. Grass Channel C/D Soils",null,"4.b. Grass Channel C/D Soils"]
["4.c. Grass Channel Compost Amended Soils",null,"4.c. Grass Channel Compost Amended Soils",null,null,null,"4.c. Grass Channel Compost Amended Soils",null,null,"4.c. Grass Channel Compost Amended Soils",null,"4.c. Grass Channel Compost Amended Soils"]
["5.a. Dry Swale #1",null,"5.a. Dry Swale #1",null,null,null,"5.a. Dry Swale #1",null,null,"5.a. Dry Swale #1",null,"5.a. Dry Swale #1"]
["5.b. Dry Swale #2",null,"5.b. Dry Swale #2",null,null,null,"5.b. Dry Swale #2",null,null,"5.b. Dry Swale #2",null,"5.b. Dry Swale #2"]
["6.a. Bioretention #1",null,"6.a. Bioretention #1",null,null,null,"6.a. Bioretention #1",null,null,"6.a. Bioretention #1",null,"6.a. Bioretention #1"]
["6.b. Bioretention #2",null,"6.b. Bioretention #2",null,null,null,"6.b. Bioretention #2",null,null,"6.b. Bioretention #2",null,"6.b. Bioretention #2"]
["7.a. Infiltration #1",null,"7.a. Infiltration #1",null,null,null,"7.a. Infiltration #1",null,null,"7.a. Infiltration #1",null,"7.a. Infiltration #1"]
["7.b. Infiltration #2",null,"7.b. Infiltration #2",null,null,null,"7.b. Infiltration #2",null,null,"7.b. Infiltration #2",null,"7.b. Infiltration #2"]
[{"$f":"P156","v":"8.b. ED #2"},null,"8.a. ED #1",null,null,null,"8.a. ED #1",null,null,"8.a. ED #1",null,"8.a. ED #1"]
["9.a. Sheetflow to A/B Soil Conservation Area ",null,{"$f":"P157","v":"9.a. Sheetflow to A/B Soil Conservation Area "},null,null,null,"8.b. ED #2",null,null,"8.b. ED #2",null,"8.b. ED #2"]
["9.b. Sheetflow to C/D Soil Conservation Area",null,"9.b. Sheetflow to C/D Soil Conservation Area",null,null,null,"9.a. Sheetflow to A/B Soil Conservation Area ",null,null,"9.a. Sheetflow to A/B Soil Conservation Area ",null,"9.a. Sheetflow to A/B Soil Conservation Area "]
["9.c. Sheetflow to Vegetated Filter Strip",null,"9.c. Sheetflow to Vegetated Filter Strip",null,null,null,"9.b. Sheetflow to C/D Soil Conservation Area",null,null,"9.b. Sheetflow to C/D Soil Conservation Area",null,"9.b. Sheetflow to C/D Soil Conservation Area"]
["10.a. Regenerative Stormwater Conveyance #1",null,"10.a. Regenerative Stormwater Conveyance #1",null,null,null,{"$f":"P160","v":"10.a. Regenerative Stormwater Conveyance #1"},null,null,"9.c. Sheetflow to Vegetated Filter Strip",null,"9.c. Sheetflow to Vegetated Filter Strip"]
["10.b. Regenerative Stormwater Conveyance #2",null,"10.b. Regenerative Stormwater Conveyance #2",null,null,null,{"$f":"P161","v":"10.b. Regenerative Stormwater Conveyance #2"},null,null,"10.a. Regenerative Stormwater Conveyance #1",null,"10.a. Regenerative Stormwater Conveyance #1"]
[{"$f":"P165","v":"12.a. Wet Swale #1"},null,{"$f":"P165","v":"12.a. Wet Swale #1"},null,null,null,{"$f":"P165","v":"12.a. Wet Swale #1"},null,null,"10.b. Regenerative Stormwater Conveyance #2",null,"10.b. Regenerative Stormwater Conveyance #2"]
["12.b. Wet Swale #2",null,"12.b. Wet Swale #2",null,null,null,"12.b. Wet Swale #2",null,null,{"$f":"P166","v":"12.b. Wet Swale #2"},null,{"$f":"P165","v":"12.a. Wet Swale #1"}]
["13.a. Filtering Practice #1",null,"13.a. Filtering Practice #1",null,null,null,"13.a. Filtering Practice #1",null,null,"13.a. Filtering Practice #1",null,{"$f":"P167","v":"13.a. Filtering Practice #1"}]
["13.b. Filtering Practice #2",null,"13.b. Filtering Practice #2",null,null,null,"13.b. Filtering Practice #2",null,null,"13.b. Filtering Practice #2",null,"13.b. Filtering Practice #2"]
["14.a. Constructed Wetland #1",null,"14.a. Constructed Wetland #1",null,null,null,"14.a. Constructed Wetland #1",null,null,"14.a. Constructed Wetland #1",null,"14.a. Constructed Wetland #1"]
["14.b. Constructed Wetland #2",null,"14.b. Constructed Wetland #2",null,null,null,"14.b. Constructed Wetland #2",null,null,"14.b. Constructed Wetland #2",null,"14.b. Constructed Wetland #2"]
["15.a. Wet Pond #1",null,"15.a. Wet Pond #1",null,null,null,"15.a. Wet Pond #1",null,null,"15.a. Wet Pond #1",null,"15.a. Wet Pond #1"]
["15.b. Wet Pond #1 (Coastal Plain)",null,"15.b. Wet Pond #1 (Coastal Plain)",null,null,null,"15.b. Wet Pond #1 (Coastal Plain)",null,null,"15.b. Wet Pond #1 (Coastal Plain)",null,"15.b. Wet Pond #1 (Coastal Plain)"]
["15.c. Wet Pond #2",null,"15.c. Wet Pond #2",null,null,null,"15.c. Wet Pond #2",null,null,"15.c. Wet Pond #2",null,"15.c. Wet Pond #2"]
["15.d. Wet Pond #2 (Coastal Plain)",null,"15.d. Wet Pond #2 (Coastal Plain)",null,null,null,"15.d. Wet Pond #2 (Coastal Plain)",null,null,"15.d. Wet Pond #2 (Coastal Plain)",null,"15.d. Wet Pond #2 (Coastal Plain)"]
["16.a. MTD - Hydrodynamic",null,"16.a. MTD - Hydrodynamic",null,null,null,"16.a. MTD - Hydrodynamic",null,null,"16.a. MTD - Hydrodynamic",null,"16.a. MTD - Hydrodynamic"]
["16.b. MTD - Filtering",null,"16.b. MTD - Filtering",null,null,null,"16.b. MTD - Filtering",null,null,"16.b. MTD - Filtering",null,"16.b. MTD - Filtering"]
["16.c. MTD - Generic",null,"16.c. MTD - Generic",null,null,null,"16.c. MTD - Generic",null,null,"16.c. MTD - Generic",null,"16.c. MTD - Generic"]
[]
[]
[]
["Options for 11 A.  Filtering Practice #1",null,"Options for 11 b.  Filtering Practice #2",null,"Options for 12.a.  Constructed Wetland #1",null,"Options for 12.b.  Constructed Wetland #2",null,null,"Options for 13.a.  Wet Pond #1",null,"Options for 13.b.  Wet Pond #1 (Coastal Plain)"]
[null,null,null,null,null,null,null,null,null,{"$f":"P135","v":"None"},null,{"$f":"P135","v":"None"}]
[{"$f":"P135","v":"None"},null,{"$f":"P135","v":"None"},null,{"$f":"P135","v":"None"},null,{"$f":"P135","v":"None"},null,null,{"$f":"P146","v":"4.a. Grass Channel A/B Soils"},null,{"$f":"P146","v":"4.a. Grass Channel A/B Soils"}]
[{"$f":"P146","v":"4.a. Grass Channel A/B Soils"},null,{"$f":"P146","v":"4.a. Grass Channel A/B Soils"},null,{"$f":"P146","v":"4.a. Grass Channel A/B Soils"},null,{"$f":"P146","v":"4.a. Grass Channel A/B Soils"},null,null,"4.b. Grass Channel C/D Soils",null,"4.b. Grass Channel C/D Soils"]
["4.b. Grass Channel C/D Soils",null,"4.b. Grass Channel C/D Soils",null,"4.b. Grass Channel C/D Soils",null,"4.b. Grass Channel C/D Soils",null,null,"4.c. Grass Channel Compost Amended Soils",null,"4.c. Grass Channel Compost Amended Soils"]
["4.c. Grass Channel Compost Amended Soils",null,"4.c. Grass Channel Compost Amended Soils",null,"4.c. Grass Channel Compost Amended Soils",null,"4.c. Grass Channel Compost Amended Soils",null,null,"5.a. Dry Swale #1",null,"5.a. Dry Swale #1"]
["5.a. Dry Swale #1",null,"5.a. Dry Swale #1",null,"5.a. Dry Swale #1",null,"5.a. Dry Swale #1",null,null,"5.b. Dry Swale #2",null,"5.b. Dry Swale #2"]
["5.b. Dry Swale #2",null,"5.b. Dry Swale #2",null,"5.b. Dry Swale #2",null,"5.b. Dry Swale #2",null,null,"6.a. Bioretention #1",null,"6.a. Bioretention #1"]
["6.a. Bioretention #1",null,"6.a. Bioretention #1",null,"6.a. Bioretention #1",null,"6.a. Bioretention #1",null,null,"6.b. Bioretention #2",null,"6.b. Bioretention #2"]
["6.b. Bioretention #2",null,"6.b. Bioretention #2",null,"6.b. Bioretention #2",null,"6.b. Bioretention #2",null,null,"7.a. Infiltration #1",null,"7.a. Infiltration #1"]
["7.a. Infiltration #1",null,"7.a. Infiltration #1",null,"7.a. Infiltration #1",null,"7.a. Infiltration #1",null,null,"7.b. Infiltration #2",null,"7.b. Infiltration #2"]
["7.b. Infiltration #2",null,"7.b. Infiltration #2",null,"7.b. Infiltration #2",null,"7.b. Infiltration #2",null,null,"8.a. ED #1",null,"8.a. ED #1"]
["8.a. ED #1",null,"8.a. ED #1",null,"8.a. ED #1",null,"8.a. ED #1",null,null,"8.b. ED #2",null,"8.b. ED #2"]
["8.b. ED #2",null,"8.b. ED #2",null,"8.b. ED #2",null,"8.b. ED #2",null,null,"9.a. Sheetflow to A/B Soil Conservation Area ",null,"9.a. Sheetflow to A/B Soil Conservation Area "]
["9.a. Sheetflow to A/B Soil Conservation Area ",null,"9.a. Sheetflow to A/B Soil Conservation Area ",null,"9.a. Sheetflow to A/B Soil Conservation Area ",null,"9.a. Sheetflow to A/B Soil Conservation Area ",null,null,"9.b. Sheetflow to C/D Soil Conservation Area",null,"9.b. Sheetflow to C/D Soil Conservation Area"]
["9.b. Sheetflow to C/D Soil Conservation Area",null,"9.b. Sheetflow to C/D Soil Conservation Area",null,"9.b. Sheetflow to C/D Soil Conservation Area",null,"9.b. Sheetflow to C/D Soil Conservation Area",null,null,"9.c. Sheetflow to Vegetated Filter Strip",null,"9.c. Sheetflow to Vegetated Filter Strip"]
["9.c. Sheetflow to Vegetated Filter Strip",null,"9.c. Sheetflow to Vegetated Filter Strip",null,"9.c. Sheetflow to Vegetated Filter Strip",null,"9.c. Sheetflow to Vegetated Filter Strip",null,null,"10.a. Regenerative Stormwater Conveyance #1",null,"10.a. Regenerative Stormwater Conveyance #1"]
[{"$f":"P165","v":"12.a. Wet Swale #1"},null,"10.a. Regenerative Stormwater Conveyance #1",null,"10.a. Regenerative Stormwater Conveyance #1",null,"10.a. Regenerative Stormwater Conveyance #1",null,null,"10.b. Regenerative Stormwater Conveyance #2",null,"10.b. Regenerative Stormwater Conveyance #2"]
[{"$f":"P166","v":"12.b. Wet Swale #2"},null,"10.b. Regenerative Stormwater Conveyance #2",null,"10.b. Regenerative Stormwater Conveyance #2",null,"10.b. Regenerative Stormwater Conveyance #2",null,null,{"$f":"P165","v":"12.a. Wet Swale #1"},null,{"$f":"P165","v":"12.a. Wet Swale #1"}]
[{"$f":"P168","v":"13.b. Filtering Practice #2"},null,{"$f":"P165","v":"12.a. Wet Swale #1"},null,{"$f":"P165","v":"12.a. Wet Swale #1"},null,{"$f":"P165","v":"12.a. Wet Swale #1"},null,null,"12.b. Wet Swale #2",null,"12.b. Wet Swale #2"]
["14.a. Constructed Wetland #1",null,{"$f":"P166","v":"12.b. Wet Swale #2"},null,{"$f":"P166","v":"12.b. Wet Swale #2"},null,{"$f":"P166","v":"12.b. Wet Swale #2"},null,null,"13.a. Filtering Practice #1",null,"13.a. Filtering Practice #1"]
["14.b. Constructed Wetland #2",null,{"$f":"P167","v":"13.a. Filtering Practice #1"},null,{"$f":"P167","v":"13.a. Filtering Practice #1"},null,{"$f":"P167","v":"13.a. Filtering Practice #1"},null,null,"13.b. Filtering Practice #2",null,"13.b. Filtering Practice #2"]
["15.a. Wet Pond #1",null,{"$f":"P169","v":"14.a. Constructed Wetland #1"},null,{"$f":"P168","v":"13.b. Filtering Practice #2"},null,{"$f":"P168","v":"13.b. Filtering Practice #2"},null,null,"14.a. Constructed Wetland #1",null,"14.a. Constructed Wetland #1"]
["15.b. Wet Pond #1 (Coastal Plain)",null,"14.b. Constructed Wetland #2",null,{"$f":"P170","v":"14.b. Constructed Wetland #2"},null,{"$f":"P169","v":"14.a. Constructed Wetland #1"},null,null,"14.b. Constructed Wetland #2",null,"14.b. Constructed Wetland #2"]
["15.c. Wet Pond #2",null,"15.a. Wet Pond #1",null,"15.a. Wet Pond #1",null,{"$f":"P171","v":"15.a. Wet Pond #1"},null,null,{"$f":"P173","v":"15.c. Wet Pond #2"},null,{"$f":"P174","v":"15.d. Wet Pond #2 (Coastal Plain)"}]
["15.d. Wet Pond #2 (Coastal Plain)",null,"15.b. Wet Pond #1 (Coastal Plain)",null,"15.b. Wet Pond #1 (Coastal Plain)",null,"15.b. Wet Pond #1 (Coastal Plain)",null,null,{"$f":"P175","v":"16.a. MTD - Hydrodynamic"},null,{"$f":"P175","v":"16.a. MTD - Hydrodynamic"}]
["16.a. MTD - Hydrodynamic",null,"15.c. Wet Pond #2",null,"15.c. Wet Pond #2",null,"15.c. Wet Pond #2",null,null,{"$f":"P176","v":"16.b. MTD - Filtering"},null,{"$f":"P176","v":"16.b. MTD - Filtering"}]
["16.b. MTD - Filtering",null,"15.d. Wet Pond #2 (Coastal Plain)",null,"15.d. Wet Pond #2 (Coastal Plain)",null,"15.d. Wet Pond #2 (Coastal Plain)",null,null,{"$f":"P177","v":"16.c. MTD - Generic"},null,{"$f":"P177","v":"16.c. MTD - Generic"}]
["16.c. MTD - Generic",null,"16.a. MTD - Hydrodynamic",null,"16.a. MTD - Hydrodynamic",null,"16.a. MTD - Hydrodynamic"]
[null,null,"16.b. MTD - Filtering",null,"16.b. MTD - Filtering",null,"16.b. MTD - Filtering"]
[null,null,"16.c. MTD - Generic",null,"16.c. MTD - Generic",null,"16.c. MTD - Generic"]
[]
[]
[]
["Options for 13.c.  Wet Pond #2",null,"Options for 13.d.  Wet Pond #2 (Coastal Plain)",null,"Options for 14.a.  Manufactured Device-Hydrodynamic",null,"Options for 14.b.  Manufactured Device-Filtering",null,null,null,"Options for 14.c.  Manufactured Device-Generic"]
[]
[{"$f":"P135","v":"None"},null,{"$f":"P135","v":"None"},null,{"$f":"P135","v":"None"},null,{"$f":"P135","v":"None"},null,null,null,{"$f":"P135","v":"None"}]
[{"$f":"P146","v":"4.a. Grass Channel A/B Soils"},null,{"$f":"P146","v":"4.a. Grass Channel A/B Soils"},null,{"$f":"P146","v":"4.a. Grass Channel A/B Soils"},null,{"$f":"P146","v":"4.a. Grass Channel A/B Soils"},null,null,null,{"$f":"P146","v":"4.a. Grass Channel A/B Soils"}]
["4.b. Grass Channel C/D Soils",null,"4.b. Grass Channel C/D Soils",null,"4.b. Grass Channel C/D Soils",null,"4.b. Grass Channel C/D Soils",null,null,null,"4.b. Grass Channel C/D Soils"]
["4.c. Grass Channel Compost Amended Soils",null,"4.c. Grass Channel Compost Amended Soils",null,"4.c. Grass Channel Compost Amended Soils",null,"4.c. Grass Channel Compost Amended Soils",null,null,null,"4.c. Grass Channel Compost Amended Soils"]
["5.a. Dry Swale #1",null,"5.a. Dry Swale #1",null,"5.a. Dry Swale #1",null,"5.a. Dry Swale #1",null,null,null,"5.a. Dry Swale #1"]
["5.b. Dry Swale #2",null,"5.b. Dry Swale #2",null,"5.b. Dry Swale #2",null,"5.b. Dry Swale #2",null,null,null,"5.b. Dry Swale #2"]
["6.a. Bioretention #1",null,"6.a. Bioretention #1",null,"6.a. Bioretention #1",null,"6.a. Bioretention #1",null,null,null,"6.a. Bioretention #1"]
["6.b. Bioretention #2",null,"6.b. Bioretention #2",null,"6.b. Bioretention #2",null,"6.b. Bioretention #2",null,null,null,"6.b. Bioretention #2"]
["7.a. Infiltration #1",null,"7.a. Infiltration #1",null,"7.a. Infiltration #1",null,"7.a. Infiltration #1",null,null,null,"7.a. Infiltration #1"]
["7.b. Infiltration #2",null,"7.b. Infiltration #2",null,"7.b. Infiltration #2",null,"7.b. Infiltration #2",null,null,null,"7.b. Infiltration #2"]
["8.a. ED #1",null,"8.a. ED #1",null,"8.a. ED #1",null,"8.a. ED #1",null,null,null,"8.a. ED #1"]
["8.b. ED #2",null,"8.b. ED #2",null,"8.b. ED #2",null,"8.b. ED #2",null,null,null,"8.b. ED #2"]
["9.a. Sheetflow to A/B Soil Conservation Area ",null,"9.a. Sheetflow to A/B Soil Conservation Area ",null,"9.a. Sheetflow to A/B Soil Conservation Area ",null,"9.a. Sheetflow to A/B Soil Conservation Area ",null,null,null,"9.a. Sheetflow to A/B Soil Conservation Area "]
["9.b. Sheetflow to C/D Soil Conservation Area",null,"9.b. Sheetflow to C/D Soil Conservation Area",null,"9.b. Sheetflow to C/D Soil Conservation Area",null,"9.b. Sheetflow to C/D Soil Conservation Area",null,null,null,"9.b. Sheetflow to C/D Soil Conservation Area"]
["9.c. Sheetflow to Vegetated Filter Strip",null,"9.c. Sheetflow to Vegetated Filter Strip",null,"9.c. Sheetflow to Vegetated Filter Strip",null,"9.c. Sheetflow to Vegetated Filter Strip",null,null,null,"9.c. Sheetflow to Vegetated Filter Strip"]
["10.a. Regenerative Stormwater Conveyance #1",null,"10.a. Regenerative Stormwater Conveyance #1",null,"10.a. Regenerative Stormwater Conveyance #1",null,"10.a. Regenerative Stormwater Conveyance #1",null,null,null,"10.a. Regenerative Stormwater Conveyance #1"]
["10.b. Regenerative Stormwater Conveyance #2",null,"10.b. Regenerative Stormwater Conveyance #2",null,"10.b. Regenerative Stormwater Conveyance #2",null,"10.b. Regenerative Stormwater Conveyance #2",null,null,null,"10.b. Regenerative Stormwater Conveyance #2"]
[{"$f":"P165","v":"12.a. Wet Swale #1"},null,{"$f":"P165","v":"12.a. Wet Swale #1"},null,{"$f":"P165","v":"12.a. Wet Swale #1"},null,{"$f":"P165","v":"12.a. Wet Swale #1"},null,null,null,{"$f":"P165","v":"12.a. Wet Swale #1"}]
["12.b. Wet Swale #2",null,"12.b. Wet Swale #2",null,"12.b. Wet Swale #2",null,"12.b. Wet Swale #2",null,null,null,"12.b. Wet Swale #2"]
["13.a. Filtering Practice #1",null,"13.a. Filtering Practice #1",null,"13.a. Filtering Practice #1",null,"13.a. Filtering Practice #1",null,null,null,"13.a. Filtering Practice #1"]
["13.b. Filtering Practice #2",null,"13.b. Filtering Practice #2",null,"13.b. Filtering Practice #2",null,"13.b. Filtering Practice #2",null,null,null,"13.b. Filtering Practice #2"]
["14.a. Constructed Wetland #1",null,"14.a. Constructed Wetland #1",null,"14.a. Constructed Wetland #1",null,"14.a. Constructed Wetland #1",null,null,null,"14.a. Constructed Wetland #1"]
["14.b. Constructed Wetland #2",null,"14.b. Constructed Wetland #2",null,"14.b. Constructed Wetland #2",null,"14.b. Constructed Wetland #2",null,null,null,"14.b. Constructed Wetland #2"]
["15.a. Wet Pond #1",null,{"$f":"P172","v":"15.b. Wet Pond #1 (Coastal Plain)"},null,"15.a. Wet Pond #1",null,"15.a. Wet Pond #1",null,null,null,"15.a. Wet Pond #1"]
[{"$f":"P175","v":"16.a. MTD - Hydrodynamic"},null,{"$f":"P175","v":"16.a. MTD - Hydrodynamic"},null,"15.b. Wet Pond #1 (Coastal Plain)",null,"15.b. Wet Pond #1 (Coastal Plain)",null,null,null,"15.b. Wet Pond #1 (Coastal Plain)"]
[{"$f":"P176","v":"16.b. MTD - Filtering"},null,{"$f":"P176","v":"16.b. MTD - Filtering"},null,"15.c. Wet Pond #2",null,"15.c. Wet Pond #2",null,null,null,"15.c. Wet Pond #2"]
[{"$f":"P177","v":"16.c. MTD - Generic"},null,{"$f":"P177","v":"16.c. MTD - Generic"},null,"15.d. Wet Pond #2 (Coastal Plain)",null,"15.d. Wet Pond #2 (Coastal Plain)",null,null,null,"15.d. Wet Pond #2 (Coastal Plain)"]
[null,null,null,null,{"$f":"P176","v":"16.b. MTD - Filtering"}]
[]
[]
[]
["Options for 10.a. Regenerative Stormwater Conveyance #1",null,"Options for 10.b. Regenerative Stormwater Conveyance #1",null,null,null,"Options for 11.a. Trees over Pervious, A/B",null,null,null,"Options for 11.b. Trees over Pervious, C/D",null,null,"Options for 11.c. Trees over Impervious"]
[]
[{"$f":"P135","v":"None"},null,{"$f":"P135","v":"None"},null,null,null,{"$f":"P135","v":"None"},null,null,null,{"$f":"P135","v":"None"},null,null,{"$f":"P135","v":"None"}]
[null,null,null,null,null,null,{"$f":"P146","v":"4.a. Grass Channel A/B Soils"},null,null,null,{"$f":"P146","v":"4.a. Grass Channel A/B Soils"},null,null,{"$f":"P146","v":"4.a. Grass Channel A/B Soils"}]
[null,null,null,null,null,null,{"$f":"P147","v":"4.b. Grass Channel C/D Soils"},null,null,null,{"$f":"P147","v":"4.b. Grass Channel C/D Soils"},null,null,{"$f":"P147","v":"4.b. Grass Channel C/D Soils"}]
[null,null,null,null,null,null,{"$f":"P148","v":"4.c. Grass Channel Compost Amended Soils"},null,null,null,{"$f":"P148","v":"4.c. Grass Channel Compost Amended Soils"},null,null,"4.c. Grass Channel Compost Amended Soils"]
[null,null,null,null,null,null,"5.a. Dry Swale #1",null,null,null,"5.a. Dry Swale #1",null,null,"5.a. Dry Swale #1"]
[null,null,null,null,null,null,"5.b. Dry Swale #2",null,null,null,"5.b. Dry Swale #2",null,null,"5.b. Dry Swale #2"]
[null,null,null,null,null,null,"6.a. Bioretention #1",null,null,null,"6.a. Bioretention #1",null,null,"6.a. Bioretention #1"]
[null,null,null,null,null,null,"6.b. Bioretention #2",null,null,null,"6.b. Bioretention #2",null,null,"6.b. Bioretention #2"]
[null,null,null,null,null,null,"7.a. Infiltration #1",null,null,null,"7.a. Infiltration #1",null,null,"7.a. Infiltration #1"]
[null,null,null,null,null,null,"7.b. Infiltration #2",null,null,null,"7.b. Infiltration #2",null,null,"7.b. Infiltration #2"]
[null,null,null,null,null,null,"8.a. ED #1",null,null,null,"8.a. ED #1",null,null,"8.a. ED #1"]
[null,null,null,null,null,null,"8.b. ED #2",null,null,null,"8.b. ED #2",null,null,"8.b. ED #2"]
[null,null,null,null,null,null,"9.a. Sheetflow to A/B Soil Conservation Area ",null,null,null,"9.a. Sheetflow to A/B Soil Conservation Area ",null,null,"9.a. Sheetflow to A/B Soil Conservation Area "]
[null,null,null,null,null,null,"9.b. Sheetflow to C/D Soil Conservation Area",null,null,null,"9.b. Sheetflow to C/D Soil Conservation Area",null,null,"9.b. Sheetflow to C/D Soil Conservation Area"]
[null,null,null,null,null,null,"9.c. Sheetflow to Vegetated Filter Strip",null,null,null,"9.c. Sheetflow to Vegetated Filter Strip",null,null,"9.c. Sheetflow to Vegetated Filter Strip"]
[null,null,null,null,null,null,"10.a. Regenerative Stormwater Conveyance #1",null,null,null,"10.a. Regenerative Stormwater Conveyance #1",null,null,"10.a. Regenerative Stormwater Conveyance #1"]
[null,null,null,null,null,null,"10.b. Regenerative Stormwater Conveyance #2",null,null,null,"10.b. Regenerative Stormwater Conveyance #2",null,null,"10.b. Regenerative Stormwater Conveyance #2"]
[null,null,null,null,null,null,{"$f":"P165","v":"12.a. Wet Swale #1"},null,null,null,{"$f":"P165","v":"12.a. Wet Swale #1"},null,null,{"$f":"P165","v":"12.a. Wet Swale #1"}]
[null,null,null,null,null,null,{"$f":"P166","v":"12.b. Wet Swale #2"},null,null,null,{"$f":"P166","v":"12.b. Wet Swale #2"},null,null,{"$f":"P166","v":"12.b. Wet Swale #2"}]
[null,null,null,null,null,null,{"$f":"P167","v":"13.a. Filtering Practice #1"},null,null,null,{"$f":"P167","v":"13.a. Filtering Practice #1"},null,null,"13.a. Filtering Practice #1"]
[null,null,null,null,null,null,"13.b. Filtering Practice #2",null,null,null,"13.b. Filtering Practice #2",null,null,"13.b. Filtering Practice #2"]
[null,null,null,null,null,null,"14.a. Constructed Wetland #1",null,null,null,"14.a. Constructed Wetland #1",null,null,"14.a. Constructed Wetland #1"]
[null,null,null,null,null,null,"14.b. Constructed Wetland #2",null,null,null,"14.b. Constructed Wetland #2",null,null,"14.b. Constructed Wetland #2"]
[null,null,null,null,null,null,"15.a. Wet Pond #1",null,null,null,"15.a. Wet Pond #1",null,null,"15.a. Wet Pond #1"]
[null,null,null,null,null,null,"15.b. Wet Pond #1 (Coastal Plain)",null,null,null,"15.b. Wet Pond #1 (Coastal Plain)",null,null,"15.b. Wet Pond #1 (Coastal Plain)"]
[null,null,null,null,null,null,"15.c. Wet Pond #2",null,null,null,"15.c. Wet Pond #2",null,null,"15.c. Wet Pond #2"]
[null,null,null,null,null,null,"15.d. Wet Pond #2 (Coastal Plain)",null,null,null,"15.d. Wet Pond #2 (Coastal Plain)",null,null,"15.d. Wet Pond #2 (Coastal Plain)"]
[null,null,null,null,null,null,"16.a. MTD - Hydrodynamic",null,null,null,"16.a. MTD - Hydrodynamic",null,null,"16.a. MTD - Hydrodynamic"]
[null,null,null,null,null,null,"16.b. MTD - Filtering",null,null,null,"16.b. MTD - Filtering",null,null,"16.b. MTD - Filtering"]
[null,null,null,null,null,null,"16.c. MTD - Generic",null,null,null,"16.c. MTD - Generic",null,null,"16.c. MTD - Generic"]

{"sheet":"D.A. C","index":5,"n_rows":340,"n_cols":24,"rows_kept":340,"cut":false,"hidden":false,"merged":[[64,14,64,15],[100,14,100,15],[101,14,101,15],[102,14,102,15],[91,14,91,15],[94,14,94,15],[95,14,95,15],[96,14,96,15],[97,14,97,15],[99,0,99,1],[80,16,80,17],[82,14,82,15],[83,14,83,15],[86,14,86,15],[87,14,87,15],[90,14,90,15],[80,1,80,2],[55,14,55,15],[58,14,58,15],[59,14,59,15],[62,14,62,15],[63,14,63,15],[54,14,54,15],[33,14,33,15],[34,14,34,15],[37,14,37,15],[38,14,38,15],[41,14,41,15],[42,14,42,15],[45,14,45,15],[46,14,46,15],[49,14,49,15],[50,14,50,15],[53,14,53,15],[32,14,32,15],[17,14,17,15],[18,14,18,15],[19,14,19,15],[20,14,20,15],[21,14,21,15],[22,14,22,15],[23,14,23,15],[24,14,24,15],[25,14,25,15],[28,14,28,15],[29,14,29,15],[14,14,14,15],[0,3,0,4],[7,9,7,12],[8,9,8,12],[11,14,11,15],[13,14,13,15],[10,14,10,15]]}
["Drainage Area C",null,null,null,null,null,null,null,null,null,null,null,null,"VRRM 4.1, 2024"]
[]
["Drainage Area C Land Cover  (acres)"]
[null,"A Soils","B Soils","C Soils","D Soils","Totals","Land Cover Rv","Composite Loading P",null,null,null,null,null,null,null,null,null,"Composite Loading N"]
["Forest (acres)",null,null,null,null,{"$f":"SUMIF(B5:E5,\">=0\")","v":0},{"$f":"IF(F5>0,(B5*Constants!$B$7+C5*Constants!$C$7+D5*Constants!$D$7+E5*Constants!$E$7)/F5,0)","v":0},{"$f":"IF(G5>0,(B5*Constants!$B14/F5)+(C5*Constants!$C14/F5)+(D5*Constants!$D14/F5)+(E5*Constants!$E14/F5),0)","v":0},null,null,null,null,null,null,null,null,null,{"$f":"IF(G5>0,(B5*Constants!$B21/F5)+(C5*Constants!$C21/F5)+(D5*Constants!$D21/F5)+(E5*Constants!$E21/F5),0)","v":0}]
["Mixed Open (acres)",null,null,null,null,{"$f":"SUMIF(B6:E6,\">=0\")","v":0},{"$f":"IF(F6>0,(B6*Constants!$B$8+C6*Constants!$C$8+D6*Constants!$D$8+E6*Constants!$E$8)/F6,0)","v":0},{"$f":"IF(G6>0,(B6*Constants!$B15/F6)+(C6*Constants!$C15/F6)+(D6*Constants!$D15/F6)+(E6*Constants!$E15/F6),0)","v":0},null,null,null,null,null,null,null,null,null,{"$f":"IF(G6>0,(B6*Constants!$B22/F6)+(C6*Constants!$C22/F6)+(D6*Constants!$D22/F6)+(E6*Constants!$E22/F6),0)","v":0}]
["Managed Turf (acres)",null,null,null,null,{"$f":"SUMIF(B7:E7,\">=0\")","v":0},{"$f":"IF(F7>0,(B7*Constants!$B$9+C7*Constants!$C$9+D7*Constants!$D$9+E7*Constants!$E$9)/F7,0)","v":0},{"$f":"IF(G7>0,(B7*Constants!$B16/F7)+(C7*Constants!$C16/F7)+(D7*Constants!$D16/F7)+(E7*Constants!$E16/F7),0)","v":0},null,null,null,null,null,null,null,null,null,{"$f":"IF(G7>0,(B7*Constants!$B23/F7)+(C7*Constants!$C23/F7)+(D7*Constants!$D23/F7)+(E7*Constants!$E23/F7),0)","v":0}]
["Impervious Cover (acres) ",null,null,null,null,{"$f":"SUMIF(B8:E8,\">=0\")","v":0},{"$f":"IF(F8>0,(B8*Constants!$B$10+C8*Constants!$C$10+D8*Constants!$D$10+E8*Constants!$E$10)/F8,0)","v":0},{"$f":"IF(G8>0,(B8*Constants!$B17/F8)+(C8*Constants!$C17/F8)+(D8*Constants!$D17/F8)+(E8*Constants!$E17/F8),0)","v":0},null,"     Total Phosphorus Available for Removal in D.A. C (lb/yr)",null,null,null,{"$f":"SUMPRODUCT(B6:E8,Constants!B15:E17)","v":0},null,null,null,{"$f":"IF(G8>0,(B8*Constants!$B24/F8)+(C8*Constants!$C24/F8)+(D8*Constants!$D24/F8)+(E8*Constants!$E24/F8),0)","v":0}]
[null,null,null,null,"Total",{"$f":"SUM(F5:F8)","v":0},null,null,null,"Post Development Treatment Volume in D.A. C (ft3)",null,null,null,{"$f":"IFERROR(Constants!$B$2/12*(F7*G7+F8*G8+F6*G6)/(F7+F8+F6)*(F7+F8+F6)*43560,0)","v":0}]
[]
["Stormwater Best Management Practices (RR = Runoff Reduction)",null,null,null,null,null,null,null,null,null,null,null,null,null,"--Select from dropdown lists--"]
["Practice","Runoff Reduction Credit (%)","Mixed Open Credit Area (acres) ","Managed Turf Credit Area (acres) ","Impervious Cover Credit Area (acres)","Volume from Upstream Practice (ft3)","Runoff Reduction (ft3)","Remaining Runoff Volume  (ft3)","Total BMP Treatment Volume (ft3)","Phosphorus Removal Efficiency (%)","Phosphorus Load from Upstream Practices (lb)","Untreated Phosphorus Load to Practice (lb)","Phosphorus Removed By Practice (lb)","Remaining Phosphorus Load (lb)","Downstream Practice to be Employed",null,null,"Nitrogen Removal Efficiency (%)","Nitrogen Load from Upstream  Practices (lbs)","Untreated Nitrogen Load to Practice (lbs)","Nitrogen Removed By Practice (lbs)","Remaining Nitrogen Load (lbs)"]
["1. Vegetated Roof (RR)",null,null,null,null,null,null,null,null,null,null,null,null,null,null,null,null,"1. Vegetated Roof (RR)"]
["1.a. Vegetated Roof #1 (P-FIL-02)",{"$f":"Constants!$B28","v":45},null,null,null,null,{"$f":"(Constants!$B$2*($G$8*$E14)*3630)*$B14/100","v":0},{"$f":"(Constants!$B$2*($G$8*$E14)*3630)*(1-$B14/100)","v":0},{"$f":"+$G14+$H14","v":0},{"$f":"Constants!C28","v":0},null,{"$f":"E14*$H$8","v":0},{"$f":"IFERROR($L14*($G14+$H14*$J14/100)/($I14),0)","v":0},{"$f":"$L14-$M14","v":0},null,null,null,{"$f":"Constants!$D28","v":0},null,{"$f":"E14*$R$8","v":0},{"$f":"IFERROR($T14*($G14+$H14*$R14/100)/$I14,0)","v":0},{"$f":"$T14-$U14","v":0}]
["1.b. Vegetated Roof #2 (P-FIL-02)",{"$f":"Constants!$B29","v":60},null,null,null,null,{"$f":"(Constants!$B$2*($G$8*$E15)*3630)*$B15/100","v":0},{"$f":"(Constants!$B$2*($G$8*$E15)*3630)*(1-$B15/100)","v":0},{"$f":"+$G15+$H15","v":0},{"$f":"Constants!C29","v":0},null,{"$f":"E15*$H$8","v":0},{"$f":"IFERROR($L15*($G15+$H15*$J15/100)/($I15),0)","v":0},{"$f":"$L15-$M15","v":0},null,null,null,{"$f":"Constants!$D29","v":0},null,{"$f":"E15*$R$8","v":0},{"$f":"IFERROR($T15*($G15+$H15*$R15/100)/$I15,0)","v":0},{"$f":"$T15-$U15","v":0}]
[]
["2. Rooftop Disconnection (RR)",null,null,null,null,null,null,null,null,null,null,null,null,null,null,null,null,"2. Rooftop Disconnection (RR)"]
["2.a. Simple Disconnection to A/B Soils \n(P-FIL-01)",{"$f":"Constants!$B32","v":50},null,null,null,{"$f":"SUMIF($O$14:$O$103,P136,$H$14:$H$103)","v":0},{"$f":"(Constants!$B$2*($G$8*$E18)*3630)*$B18/100","v":0},{"$f":"(Constants!$B$2*($G$8*$E18)*3630)*(1-$B18/100)","v":0},{"$f":"+$G18+$H18","v":0},{"$f":"Constants!C32","v":0},{"$f":"SUMIF($O$13:$O$103,P136,$N$13:$N$103)","v":0},{"$f":"E18*$H$8","v":0},{"$f":"IFERROR(($K18+$L18)*($G18+$H18*$J18/100)/$I18,0)","v":0},{"$f":"$K18+$L18-$M18","v":0},null,null,null,{"$f":"Constants!$D32","v":0},{"$f":"SUMIF($O$14:$O$103,$P136,$V$14:$V$103)","v":0},{"$f":"E18*$R$8","v":0},{"$f":"IFERROR(($S18+$T18)*($G18+$H18*$R18/100)/$I18,0)","v":0},{"$f":"$S18+$T18-$U18","v":0}]
["2.b. Simple Disconnection to C/D Soils \n(P-FIL-01)",{"$f":"Constants!$B33","v":25},null,null,null,0,{"$f":"(Constants!$B$2*($G$8*$E19)*3630)*$B19/100","v":0},{"$f":"(Constants!$B$2*($G$8*$E19)*3630)*(1-$B19/100)","v":0},{"$f":"+$G19+$H19","v":0},{"$f":"Constants!C33","v":0},0,{"$f":"E19*$H$8","v":0},{"$f":"IFERROR(($K19+$L19)*($G19+$H19*$J19/100)/$I19,0)","v":0},{"$f":"$K19+$L19-$M19","v":0},null,null,null,{"$f":"Constants!$D33","v":0},0,0,{"$f":"IFERROR(($S19+$T19)*($G19+$H19*$R19/100)/$I19,0)","v":0},{"$f":"$S19+$T19-$U19","v":0}]
["2.c. To Soil Amended Filter Path as per specifications (existing C/D soils) (P-FIL-08)",{"$f":"Constants!$B34","v":50},null,null,null,0,{"$f":"(Constants!$B$2*($G$8*$E20)*3630)*$B20/100","v":0},{"$f":"(Constants!$B$2*($G$8*$E20)*3630)*(1-$B20/100)","v":0},0,{"$f":"Constants!C34","v":0},0,{"$f":"E20*$H$8","v":0},0,0,null,null,null,{"$f":"Constants!$D34","v":0},0,0,0,0]
["2.d. To Dry Well or French Drain #1, \nMicro-Infilration #1 (P-FIL-04)",{"$f":"Constants!$B35","v":50},null,null,null,0,{"$f":"(Constants!$B$2*($G$8*$E21)*3630)*$B21/100","v":0},{"$f":"(Constants!$B$2*($G$8*$E21)*3630)*(1-$B21/100)","v":0},0,{"$f":"Constants!C35","v":25},0,0,0,{"$f":"$K21+$L21-$M21","v":0},null,null,null,{"$f":"Constants!$D35","v":15},0,0,0,0]
["2.e. To Dry Well or French Drain #2, \nMicro-Infiltration #2 (P-FIL-04)",{"$f":"Constants!$B36","v":90},null,null,null,0,{"$f":"(Constants!$B$2*($G$8*$E22)*3630)*$B22/100","v":0},{"$f":"(Constants!$B$2*($G$8*$E22)*3630)*(1-$B22/100)","v":0},0,{"$f":"Constants!C36","v":25},0,0,0,0,null,null,null,{"$f":"Constants!$D36","v":15},0,0,0,0]
["2.f. To Rain Garden #1, \nMicro-Bioretention #1 (P-FIL-05)",{"$f":"Constants!$B37","v":40},null,null,null,0,{"$f":"(Constants!$B$2*($G$8*$E23)*3630)*$B23/100","v":0},{"$f":"(Constants!$B$2*($G$8*$E23)*3630)*(1-$B23/100)","v":0},0,{"$f":"Constants!C37","v":25},0,0,0,0,null,null,null,{"$f":"Constants!$D37","v":40},0,0,0,0]
["2.g. To Rain Garden #2, \nMicro-Bioretention #2 (P-FIL-05)",{"$f":"Constants!$B38","v":80},null,null,null,0,{"$f":"(Constants!$B$2*($G$8*$E24)*3630)*$B24/100","v":0},{"$f":"(Constants!$B$2*($G$8*$E24)*3630)*(1-$B24/100)","v":0},{"$f":"+$G24+$H24","v":0},{"$f":"Constants!C38","v":50},0,0,0,0,null,null,null,{"$f":"Constants!$D38","v":60},0,0,0,0]
["2.h. To Rainwater Harvesting (P-BAS-04)",0,null,null,null,0,{"$f":"(Constants!$B$2*($G$8*$E25)*3630)*$B25/100","v":0},{"$f":"(Constants!$B$2*($G$8*$E25)*3630)*(1-$B25/100)","v":0},0,{"$f":"Constants!C39","v":0},0,0,0,0,null,null,null,{"$f":"Constants!$D39","v":0},0,0,0,0]
["2.i. To Stormwater Planter, \nUrban Bioretention (P-FIL-05)",{"$f":"Constants!$B40","v":40},null,null,null,0,{"$f":"(Constants!$B$2*($G$8*$E26)*3630)*$B26/100","v":0},{"$f":"(Constants!$B$2*($G$8*$E26)*3630)*(1-$B26/100)","v":0},0,{"$f":"Constants!C40","v":25},0,0,{"$f":"IFERROR(($K26+$L26)*($G26+$H26*$J26/100)/$I26,0)","v":0},0,null,null,null,{"$f":"Constants!$D40","v":40},0,0,0,0]
[]
["3. Permeable Pavement  (RR)",null,null,null,null,null,null,null,null,null,null,null,null,null,null,null,null,"3. Permeable Pavement  (RR)"]
["3.a. Permeable Pavement #1 (P-FIL-03)",{"$f":"Constants!$B43","v":45},null,null,null,{"$f":"SUMIF($O$14:$O$103,P145,$H$14:$H$103)","v":0},{"$f":"(Constants!$B$2*($G$8*$E29)*3630)*$B29/100","v":0},{"$f":"(Constants!$B$2*($G$8*$E29)*3630)*(1-$B29/100)","v":0},{"$f":"+$G29+$H29","v":0},{"$f":"Constants!C43","v":25},{"$f":"SUMIF($O$13:$O$103,P145,$N$13:$N$103)","v":0},{"$f":"E29*$H$8","v":0},{"$f":"IFERROR(($K29+$L29)*($G29+$H29*$J29/100)/$I29,0)","v":0},{"$f":"$K29+$L29-$M29","v":0},null,null,null,{"$f":"Constants!$D43","v":25},{"$f":"SUMIF($O$14:$O$103,$P145,$V$14:$V$103)","v":0},{"$f":"E29*$R$8","v":0},{"$f":"IFERROR(($S29+$T29)*($G29+$H29*$R29/100)/$I29,0)","v":0},{"$f":"$S29+$T29-$U29","v":0}]
["3.b. Permeable Pavement #2 (P-FIL-03)",{"$f":"Constants!$B44","v":75},null,null,null,null,{"$f":"(Constants!$B$2*($G$8*$E30)*3630)*$B30/100","v":0},{"$f":"(Constants!$B$2*($G$8*$E30)*3630)*(1-$B30/100)","v":0},{"$f":"+$G30+$H30","v":0},{"$f":"Constants!C44","v":25},null,{"$f":"E30*$H$8","v":0},{"$f":"IFERROR(($K30+$L30)*($G30+$H30*$J30/100)/$I30,0)","v":0},{"$f":"$L30-$M30","v":0},null,null,null,{"$f":"Constants!$D44","v":25},null,{"$f":"E30*$R$8","v":0},{"$f":"IFERROR(($S30+$T30)*($G30+$H30*$R30/100)/$I30,0)","v":0},{"$f":"$S30+$T30-$U30","v":0}]
[]
["4. Grass Channel (RR)",null,null,null,null,null,null,null,null,null,null,null,null,null,null,null,null,"4. Grass Channel (RR)"]
["4.a. Grass Channel A/B Soils (P-CNV-01)",{"$f":"Constants!$B47","v":20},null,null,null,{"$f":"SUMIF($O$14:$O$103,P146,$H$14:$H$103)","v":0},{"$f":"(Constants!$B$2*($G$7*$D33+$G$8*$E33+$C33*$G$6)*3630+$F33)*$B33/100","v":0},{"$f":"(Constants!$B$2*($G$7*$D33+$G$8*$E33+$C33*$G$6)*3630+$F33)*(1-$B33/100)","v":0},{"$f":"+$G33+$H33","v":0},{"$f":"Constants!C47","v":15},{"$f":"SUMIF($O$13:$O$103,P146,$N$13:$N$103)","v":0},{"$f":"(D33*$H$7)+(C33*$H$6)+(E33*$H$8)","v":0},{"$f":"IFERROR(($K33+$L33)*($G33+$H33*$J33/100)/$I33,0)","v":0},{"$f":"$K33+$L33-$M33","v":0},null,null,null,{"$f":"Constants!$D47","v":20},{"$f":"SUMIF($O$14:$O$103,$P146,$V$14:$V$103)","v":0},{"$f":"(D33*$R$7)+(C33*$R$6)+(E33*$R$8)","v":0},{"$f":"IFERROR(($S33+$T33)*($G33+$H33*$R33/100)/$I33,0)","v":0},{"$f":"$S33+$T33-$U33","v":0}]
["4.b. Grass Channel C/D Soils (P-CNV-01)",{"$f":"Constants!$B48","v":10},null,null,null,{"$f":"SUMIF($O$14:$O$103,P147,$H$14:$H$103)","v":0},{"$f":"(Constants!$B$2*($G$7*$D34+$G$8*$E34+$C34*$G$6)*3630+$F34)*$B34/100","v":0},{"$f":"(Constants!$B$2*($G$7*$D34+$G$8*$E34+$C34*$G$6)*3630+$F34)*(1-$B34/100)","v":0},{"$f":"+$G34+$H34","v":0},{"$f":"Constants!C48","v":15},{"$f":"SUMIF($O$13:$O$103,P147,$N$13:$N$103)","v":0},{"$f":"(D34*$H$7)+(C34*$H$6)+(E34*$H$8)","v":0},{"$f":"IFERROR(($K34+$L34)*($G34+$H34*$J34/100)/$I34,0)","v":0},{"$f":"$K34+$L34-$M34","v":0},null,null,null,{"$f":"Constants!$D48","v":20},{"$f":"SUMIF($O$14:$O$103,$P147,$V$14:$V$103)","v":0},{"$f":"(D34*$R$7)+(C34*$R$6)+(E34*$R$8)","v":0},{"$f":"IFERROR(($S34+$T34)*($G34+$H34*$R34/100)/$I34,0)","v":0},{"$f":"$S34+$T34-$U34","v":0}]
["4.c. Grass Channel with Compost Amended Soils as per specs (P-FIL-08)",{"$f":"Constants!$B49","v":20},null,null,null,{"$f":"SUMIF($O$14:$O$103,P148,$H$14:$H$103)","v":0},{"$f":"(Constants!$B$2*($G$7*$D35+$G$8*$E35+$C35*$G$6)*3630+$F35)*$B35/100","v":0},{"$f":"(Constants!$B$2*($G$7*$D35+$G$8*$E35+$C35*$G$6)*3630+$F35)*(1-$B35/100)","v":0},{"$f":"+$G35+$H35","v":0},{"$f":"Constants!C49","v":15},{"$f":"SUMIF($O$13:$O$103,P148,$N$13:$N$103)","v":0},{"$f":"(D35*$H$7)+(C35*$H$6)+(E35*$H$8)","v":0},{"$f":"IFERROR(($K35+$L35)*($G35+$H35*$J35/100)/$I35,0)","v":0},{"$f":"$K35+$L35-$M35","v":0},null,null,null,{"$f":"Constants!$D49","v":20},{"$f":"SUMIF($O$14:$O$103,$P148,$V$14:$V$103)","v":0},{"$f":"(D35*$R$7)+(C35*$R$6)+(E35*$R$8)","v":0},{"$f":"IFERROR(($S35+$T35)*($G35+$H35*$R35/100)/$I35,0)","v":0},{"$f":"$S35+$T35-$U35","v":0}]
[null,null,null,null,null,null,null,null,null,null,null,null,null,null,null,null,null,null,null,null,null,null,null,"`"]
["5. Dry Swale (RR)",null,null,null,null,null,null,null,null,null,null,null,null,null,null,null,null,"5. Dry Swale (RR)"]
["5.a. Dry Swale #1 (P-CNV-02)",{"$f":"Constants!$B52","v":40},null,null,null,{"$f":"SUMIF($O$14:$O$103,P149,$H$14:$H$103)","v":0},{"$f":"(Constants!$B$2*($G$7*$D38+$G$8*$E38+$C38*$G$6)*3630+$F38)*$B38/100","v":0},{"$f":"(Constants!$B$2*($G$7*$D38+$G$8*$E38+$C38*$G$6)*3630+$F38)*(1-$B38/100)","v":0},{"$f":"+$G38+$H38","v":0},{"$f":"Constants!C52","v":20},{"$f":"SUMIF($O$13:$O$103,P149,$N$13:$N$103)","v":0},{"$f":"(D38*$H$7)+(C38*$H$6)+(E38*$H$8)","v":0},{"$f":"IFERROR(($K38+$L38)*($G38+$H38*$J38/100)/$I38,0)","v":0},{"$f":"$K38+$L38-$M38","v":0},null,null,null,{"$f":"Constants!$D52","v":25},{"$f":"SUMIF($O$14:$O$103,$P149,$V$14:$V$103)","v":0},{"$f":"(D38*$R$7)+(C38*$R$6)+(E38*$R$8)","v":0},{"$f":"IFERROR(($S38+$T38)*($G38+$H38*$R38/100)/$I38,0)","v":0},{"$f":"$S38+$T38-$U38","v":0}]
["5.b. Dry Swale #2 (P-CNV-02)",{"$f":"Constants!$B53","v":60},null,null,null,{"$f":"SUMIF($O$14:$O$103,P150,$H$14:$H$103)","v":0},{"$f":"(Constants!$B$2*($G$7*$D39+$G$8*$E39+$C39*$G$6)*3630+$F39)*$B39/100","v":0},{"$f":"(Constants!$B$2*($G$7*$D39+$G$8*$E39+$C39*$G$6)*3630+$F39)*(1-$B39/100)","v":0},{"$f":"+$G39+$H39","v":0},{"$f":"Constants!C53","v":40},{"$f":"SUMIF($O$13:$O$103,P150,$N$13:$N$103)","v":0},{"$f":"(D39*$H$7)+(C39*$H$6)+(E39*$H$8)","v":0},{"$f":"IFERROR(($K39+$L39)*($G39+$H39*$J39/100)/$I39,0)","v":0},{"$f":"$K39+$L39-$M39","v":0},null,null,null,{"$f":"Constants!$D53","v":35},{"$f":"SUMIF($O$14:$O$103,$P150,$V$14:$V$103)","v":0},{"$f":"(D39*$R$7)+(C39*$R$6)+(E39*$R$8)","v":0},{"$f":"IFERROR(($S39+$T39)*($G39+$H39*$R39/100)/$I39,0)","v":0},{"$f":"$S39+$T39-$U39","v":0}]
[]
["6. Bioretention (RR)",null,null,null,null,null,null,null,null,null,null,null,null,null,null,null,null,"6. Bioretention (RR)"]
["6.a. Bioretention #1 or Micro-Bioretention #1 or Urban Bioretention (P-FIL-05)",{"$f":"Constants!$B56","v":40},null,null,null,{"$f":"SUMIF($O$14:$O$103,P151,$H$14:$H$103)","v":0},{"$f":"(Constants!$B$2*($G$7*$D42+$G$8*$E42+$C42*$G$6)*3630+$F42)*$B42/100","v":0},{"$f":"(Constants!$B$2*($G$7*$D42+$G$8*$E42+$C42*$G$6)*3630+$F42)*(1-$B42/100)","v":0},{"$f":"+$G42+$H42","v":0},{"$f":"Constants!C56","v":25},{"$f":"SUMIF($O$13:$O$103,P151,$N$13:$N$103)","v":0},{"$f":"(D42*$H$7)+(C42*$H$6)+(E42*$H$8)","v":0},{"$f":"IFERROR(($K42+$L42)*($G42+$H42*$J42/100)/$I42,0)","v":0},{"$f":"$K42+$L42-$M42","v":0},null,null,null,{"$f":"Constants!$D56","v":40},{"$f":"SUMIF($O$14:$O$103,$P151,$V$14:$V$103)","v":0},{"$f":"(D42*$R$7)+(C42*$R$6)+(E42*$R$8)","v":0},{"$f":"IFERROR(($S42+$T42)*($G42+$H42*$R42/100)/$I42,0)","v":0},{"$f":"$S42+$T42-$U42","v":0}]
["6.b. Bioretention #2 or \nMicro-Bioretention #2 (P-FIL-05)",{"$f":"Constants!$B57","v":80},null,null,null,{"$f":"SUMIF($O$14:$O$103,P152,$H$14:$H$103)","v":0},{"$f":"(Constants!$B$2*($G$7*$D43+$G$8*$E43+$C43*$G$6)*3630+$F43)*$B43/100","v":0},{"$f":"(Constants!$B$2*($G$7*$D43+$G$8*$E43+$C43*$G$6)*3630+$F43)*(1-$B43/100)","v":0},{"$f":"+$G43+$H43","v":0},{"$f":"Constants!C57","v":50},{"$f":"SUMIF($O$13:$O$103,P152,$N$13:$N$103)","v":0},{"$f":"(D43*$H$7)+(C43*$H$6)+(E43*$H$8)","v":0},{"$f":"IFERROR(($K43+$L43)*($G43+$H43*$J43/100)/$I43,0)","v":0},{"$f":"$K43+$L43-$M43","v":0},null,null,null,{"$f":"Constants!$D57","v":60},{"$f":"SUMIF($O$14:$O$103,$P152,$V$14:$V$103)","v":0},{"$f":"(D43*$R$7)+(C43*$R$6)+(E43*$R$8)","v":0},{"$f":"IFERROR(($S43+$T43)*($G43+$H43*$R43/100)/$I43,0)","v":0},{"$f":"$S43+$T43-$U43","v":0}]
[]
["7. Infiltration (RR)",null,null,null,null,null,null,null,null,null,null,null,null,null,null,null,null,"7. Infiltration (RR)"]
["7.a. Infiltration #1 (P-FIL-04)",{"$f":"Constants!$B60","v":50},null,null,null,{"$f":"SUMIF($O$14:$O$103,P153,$H$14:$H$103)","v":0},{"$f":"(Constants!$B$2*($G$7*$D46+$G$8*$E46+$C46*$G$6)*3630+$F46)*$B46/100","v":0},{"$f":"(Constants!$B$2*($G$7*$D46+$G$8*$E46+$C46*$G$6)*3630+$F46)*(1-$B46/100)","v":0},{"$f":"+$G46+$H46","v":0},{"$f":"Constants!C60","v":25},{"$f":"SUMIF($O$13:$O$103,P153,$N$13:$N$103)","v":0},{"$f":"(D46*$H$7)+(C46*$H$6)+(E46*$H$8)","v":0},{"$f":"IFERROR(($K46+$L46)*($G46+$H46*$J46/100)/$I46,0)","v":0},{"$f":"$K46+$L46-$M46","v":0},null,null,null,{"$f":"Constants!$D60","v":15},{"$f":"SUMIF($O$14:$O$103,$P153,$V$14:$V$103)","v":0},{"$f":"(D46*$R$7)+(C46*$R$6)+(E46*$R$8)","v":0},{"$f":"IFERROR(($S46+$T46)*($G46+$H46*$R46/100)/$I46,0)","v":0},{"$f":"$S46+$T46-$U46","v":0}]
["7.b. Infiltration #2 (P-FIL-04)",{"$f":"Constants!$B61","v":90},null,null,null,{"$f":"SUMIF($O$14:$O$103,P154,$H$14:$H$103)","v":0},{"$f":"(Constants!$B$2*($G$7*$D47+$G$8*$E47+$C47*$G$6)*3630+$F47)*$B47/100","v":0},{"$f":"(Constants!$B$2*($G$7*$D47+$G$8*$E47+$C47*$G$6)*3630+$F47)*(1-$B47/100)","v":0},{"$f":"+$G47+$H47","v":0},{"$f":"Constants!C61","v":25},{"$f":"SUMIF($O$13:$O$103,P154,$N$13:$N$103)","v":0},{"$f":"(D47*$H$7)+(C47*$H$6)+(E47*$H$8)","v":0},{"$f":"IFERROR(($K47+$L47)*($G47+$H47*$J47/100)/$I47,0)","v":0},{"$f":"$K47+$L47-$M47","v":0},null,null,null,{"$f":"Constants!$D61","v":15},{"$f":"SUMIF($O$14:$O$103,$P154,$V$14:$V$103)","v":0},{"$f":"(D47*$R$7)+(C47*$R$6)+(E47*$R$8)","v":0},{"$f":"IFERROR(($S47+$T47)*($G47+$H47*$R47/100)/$I47,0)","v":0},{"$f":"$S47+$T47-$U47","v":0}]
[]
["8. Extended Detention Pond (RR)",null,null,null,null,null,null,null,null,null,null,null,null,null,null,null,null,"8. Extended Detention Pond (RR)"]
["8.a. ED #1 (P-BAS-03)",{"$f":"Constants!$B64","v":0},null,null,null,{"$f":"SUMIF($O$14:$O$103,P155,$H$14:$H$103)","v":0},{"$f":"(Constants!$B$2*($G$7*$D50+$G$8*$E50+$C50*$G$6)*3630+$F50)*$B50/100","v":0},{"$f":"(Constants!$B$2*($G$7*$D50+$G$8*$E50+$C50*$G$6)*3630+$F50)*(1-$B50/100)","v":0},{"$f":"+$G50+$H50","v":0},{"$f":"Constants!C64","v":15},{"$f":"SUMIF($O$13:$O$103,P155,$N$13:$N$103)","v":0},{"$f":"(D50*$H$7)+(C50*$H$6)+(E50*$H$8)","v":0},{"$f":"IFERROR(($K50+$L50)*($G50+$H50*$J50/100)/$I50,0)","v":0},{"$f":"$K50+$L50-$M50","v":0},null,null,null,{"$f":"Constants!$D64","v":10},{"$f":"SUMIF($O$14:$O$103,$P155,$V$14:$V$103)","v":0},{"$f":"(D50*$R$7)+(C50*$R$6)+(E50*$R$8)","v":0},{"$f":"IFERROR(($S50+$T50)*($G50+$H50*$R50/100)/$I50,0)","v":0},{"$f":"$S50+$T50-$U50","v":0}]
["8.b. ED #2 (P-BAS-03)",{"$f":"Constants!$B65","v":15},null,null,null,{"$f":"SUMIF($O$14:$O$103,P156,$H$14:$H$103)","v":0},{"$f":"(Constants!$B$2*($G$7*$D51+$G$8*$E51+$C51*$G$6)*3630+$F51)*$B51/100","v":0},{"$f":"(Constants!$B$2*($G$7*$D51+$G$8*$E51+$C51*$G$6)*3630+$F51)*(1-$B51/100)","v":0},{"$f":"+$G51+$H51","v":0},{"$f":"Constants!C65","v":15},{"$f":"SUMIF($O$13:$O$103,P156,$N$13:$N$103)","v":0},{"$f":"(D51*$H$7)+(C51*$H$6)+(E51*$H$8)","v":0},{"$f":"IFERROR(($K51+$L51)*($G51+$H51*$J51/100)/$I51,0)","v":0},{"$f":"$K51+$L51-$M51","v":0},null,null,null,{"$f":"Constants!$D65","v":10},{"$f":"SUMIF($O$14:$O$103,$P156,$V$14:$V$103)","v":0},{"$f":"(D51*$R$7)+(C51*$R$6)+(E51*$R$8)","v":0},{"$f":"IFERROR(($S51+$T51)*($G51+$H51*$R51/100)/$I51,0)","v":0},{"$f":"$S51+$T51-$U51","v":0}]
[]
["9. Sheetflow to Filter/Open Space (RR)",null,null,null,null,null,null,null,null,null,null,null,null,null,null,null,null,"9. Sheetflow to Filter/Open Space (RR)"]
["9.a. Sheetflow to Conservation Area, A/B Soils (P-FIL-07)",{"$f":"Constants!$B68","v":75},null,null,null,{"$f":"SUMIF($O$14:$O$103,P157,$H$14:$H$103)","v":0},{"$f":"(Constants!$B$2*($G$7*$D54+$G$8*$E54+$C54*$G$6)*3630+$F54)*$B54/100","v":0},{"$f":"(Constants!$B$2*($G$7*$D54+$G$8*$E54+$C54*$G$6)*3630+$F54)*(1-$B54/100)","v":0},{"$f":"+$G54+$H54","v":0},{"$f":"Constants!C68","v":0},{"$f":"SUMIF($O$13:$O$103,P157,$N$13:$N$103)","v":0},{"$f":"(D54*$H$7)+(C54*$H$6)+(E54*$H$8)","v":0},{"$f":"IFERROR(($K54+$L54)*($G54+$H54*$J54/100)/$I54,0)","v":0},{"$f":"$K54+$L54-$M54","v":0},null,null,null,{"$f":"Constants!$D68","v":0},{"$f":"SUMIF($O$14:$O$103,$P157,$V$14:$V$103)","v":0},{"$f":"(D54*$R$7)+(C54*$R$6)+(E54*$R$8)","v":0},{"$f":"IFERROR(($S54+$T54)*($G54+$H54*$R54/100)/$I54,0)","v":0},{"$f":"$S54+$T54-$U54","v":0}]
["9.b. Sheetflow to Conservation Area, C/D Soils (P-FIL-07)",{"$f":"Constants!$B69","v":50},null,null,null,{"$f":"SUMIF($O$14:$O$103,P158,$H$14:$H$103)","v":0},{"$f":"(Constants!$B$2*($G$7*$D55+$G$8*$E55+$C55*$G$6)*3630+$F55)*$B55/100","v":0},{"$f":"(Constants!$B$2*($G$7*$D55+$G$8*$E55+$C55*$G$6)*3630+$F55)*(1-$B55/100)","v":0},{"$f":"+$G55+$H55","v":0},{"$f":"Constants!C69","v":0},{"$f":"SUMIF($O$13:$O$103,P158,$N$13:$N$103)","v":0},{"$f":"(D55*$H$7)+(C55*$H$6)+(E55*$H$8)","v":0},{"$f":"IFERROR(($K55+$L55)*($G55+$H55*$J55/100)/$I55,0)","v":0},{"$f":"$K55+$L55-$M55","v":0},null,null,null,{"$f":"Constants!$D69","v":0},{"$f":"SUMIF($O$14:$O$103,$P158,$V$14:$V$103)","v":0},{"$f":"(D55*$R$7)+(C55*$R$6)+(E55*$R$8)","v":0},{"$f":"IFERROR(($S55+$T55)*($G55+$H55*$R55/100)/$I55,0)","v":0},{"$f":"$S55+$T55-$U55","v":0}]
["9.c. Sheetflow to Vegetated Filter Strip, A Soils or Compost Amended B/C/D Soils \n(Spec P-FIL-07 & P-FIL-08)",{"$f":"Constants!$B70","v":50},null,null,null,{"$f":"SUMIF($O$14:$O$103,P159,$H$14:$H$103)","v":0},{"$f":"(Constants!$B$2*($G$7*$D56+$G$8*$E56+$C56*$G$6)*3630+$F56)*$B56/100","v":0},{"$f":"(Constants!$B$2*($G$7*$D56+$G$8*$E56+$C56*$G$6)*3630+$F56)*(1-$B56/100)","v":0},{"$f":"+$G56+$H56","v":0},{"$f":"Constants!C70","v":0},{"$f":"SUMIF($O$13:$O$103,P159,$N$13:$N$103)","v":0},{"$f":"(D56*$H$7)+(C56*$H$6)+(E56*$H$8)","v":0},{"$f":"IFERROR(($K56+$L56)*($G56+$H56*$J56/100)/$I56,0)","v":0},{"$f":"$K56+$L56-$M56","v":0},null,null,null,{"$f":"Constants!$D70","v":0},{"$f":"SUMIF($O$14:$O$103,$P159,$V$14:$V$103)","v":0},{"$f":"(D56*$R$7)+(C56*$R$6)+(E56*$R$8)","v":0},{"$f":"IFERROR(($S56+$T56)*($G56+$H56*$R56/100)/$I56,0)","v":0},{"$f":"$S56+$T56-$U56","v":0}]
[]
["10. Regenerative Stormwater Conveyance",null,null,null,null,null,null,null,null,null,null,null,null,null,null,null,null,"10. Regenerative Stormwater Conveyance"]
["10.a. Regenerative Stormwater Conveyance (P-CNV-04)",{"$f":"Constants!$B73","v":0},null,null,null,{"$f":"SUMIF($O$14:$O$103,P160,$H$14:$H$103)","v":0},{"$f":"(Constants!$B$2*($G$7*$D59+$G$8*$E59+$C59*$G$6)*3630+$F59)*$B59/100","v":0},{"$f":"(Constants!$B$2*($G$7*$D59+$G$8*$E59+$C59*$G$6)*3630+$F59)*(1-$B59/100)","v":0},{"$f":"+$G59+$H59","v":0},{"$f":"Constants!C73","v":20},{"$f":"SUMIF($O$13:$O$103,P160,$N$13:$N$103)","v":0},{"$f":"(D59*$H$7)+(C59*$H$6)+(E59*$H$8)","v":0},{"$f":"IFERROR(($K59+$L59)*($G59+$H59*$J59/100)/$I59,0)","v":0},{"$f":"$K59+$L59-$M59","v":0},null,null,null,{"$f":"Constants!$D73","v":25},{"$f":"SUMIF($O$14:$O$103,$P160,$V$14:$V$103)","v":0},{"$f":"(D59*$R$7)+(C59*$R$6)+(E59*$R$8)","v":0},{"$f":"IFERROR(($S59+$T59)*($G59+$H59*$R59/100)/$I59,0)","v":0},{"$f":"$S59+$T59-$U59","v":0}]
["10.b. Regenerative Stormwater Conveyance (P-CNV-04)",{"$f":"Constants!$B74","v":0},null,null,null,{"$f":"SUMIF($O$14:$O$103,P161,$H$14:$H$103)","v":0},{"$f":"(Constants!$B$2*($G$7*$D60+$G$8*$E60+$C60*$G$6)*3630+$F60)*$B60/100","v":0},{"$f":"(Constants!$B$2*($G$7*$D60+$G$8*$E60+$C60*$G$6)*3630+$F60)*(1-$B60/100)","v":0},{"$f":"+$G60+$H60","v":0},{"$f":"Constants!C74","v":40},{"$f":"SUMIF($O$13:$O$103,P161,$N$13:$N$103)","v":0},0,0,{"$f":"$K60+$L60-$M60","v":0},null,null,null,{"$f":"Constants!$D74","v":35},{"$f":"SUMIF($O$14:$O$103,$P161,$V$14:$V$103)","v":0},{"$f":"(D60*$R$7)+(C60*$R$6)+(E60*$R$8)","v":0},{"$f":"IFERROR(($S60+$T60)*($G60+$H60*$R60/100)/$I60,0)","v":0},{"$f":"$S60+$T60-$U60","v":0}]
[]
["11. Tree BMP",null,null,null,null,null,null,null,null,null,null,null,null,null,null,null,null,"11. Tree BMP"]
["11.a. Trees over Pervious, A/B (P-FIL-09)",{"$f":"Constants!$B77","v":16},null,null,null,{"$f":"SUMIF($O$14:$O$103,P162,$H$14:$H$103)","v":0},{"$f":"(Constants!$B$2*($G$7*$D63+$G$8*$E63+$C63*$G$6)*3630+$F63)*$B63/100","v":0},{"$f":"(Constants!$B$2*($G$7*$D63+$G$8*$E63+$C63*$G$6)*3630+$F63)*(1-$B63/100)","v":0},{"$f":"+$G63+$H63","v":0},{"$f":"Constants!C77","v":0},{"$f":"SUMIF($O$13:$O$103,P162,$N$13:$N$103)","v":0},{"$f":"(D63*$H$7)+(C63*$H$6)+(E63*$H$8)","v":0},{"$f":"IFERROR(($K63+$L63)*($G63+$H63*$J63/100)/$I63,0)","v":0},{"$f":"$K63+$L63-$M63","v":0},null,null,null,{"$f":"Constants!$D77","v":0},{"$f":"SUMIF($O$14:$O$103,$P162,$V$14:$V$103)","v":0},{"$f":"(D63*$R$7)+(C63*$R$6)+(E63*$R$8)","v":0},{"$f":"IFERROR(($S63+$T63)*($G63+$H63*$R63/100)/$I63,0)","v":0},{"$f":"$S63+$T63-$U63","v":0}]
["11.b. Trees over Pervious, C/D (P-FIL-09)",{"$f":"Constants!$B78","v":12},null,null,null,{"$f":"SUMIF($O$14:$O$103,P163,$H$14:$H$103)","v":0},{"$f":"(Constants!$B$2*($G$7*$D64+$G$8*$E64+$C64*$G$6)*3630+$F64)*$B64/100","v":0},{"$f":"(Constants!$B$2*($G$7*$D64+$G$8*$E64+$C64*$G$6)*3630+$F64)*(1-$B64/100)","v":0},{"$f":"+$G64+$H64","v":0},{"$f":"Constants!C78","v":0},{"$f":"SUMIF($O$13:$O$103,P163,$N$13:$N$103)","v":0},0,{"$f":"IFERROR(($K64+$L64)*($G64+$H64*$J64/100)/$I64,0)","v":0},{"$f":"$K64+$L64-$M64","v":0},null,null,null,{"$f":"Constants!$D78","v":0},{"$f":"SUMIF($O$14:$O$103,$P163,$V$14:$V$103)","v":0},{"$f":"(D64*$R$7)+(C64*$R$6)+(E64*$R$8)","v":0},{"$f":"IFERROR(($S64+$T64)*($G64+$H64*$R64/100)/$I64,0)","v":0},{"$f":"$S64+$T64-$U64","v":0}]
["11.c. Trees over Impervious (P-FIL-09)",{"$f":"Constants!$B79","v":3.5},null,null,null,{"$f":"SUMIF($O$14:$O$103,P164,$H$14:$H$103)","v":0},{"$f":"(Constants!$B$2*($G$7*$D65+$G$8*$E65+$C65*$G$6)*3630+$F65)*$B65/100","v":0},{"$f":"(Constants!$B$2*($G$7*$D65+$G$8*$E65+$C65*$G$6)*3630+$F65)*(1-$B65/100)","v":0},{"$f":"+$G65+$H65","v":0},{"$f":"Constants!C79","v":0},{"$f":"SUMIF($O$13:$O$103,P164,$N$13:$N$103)","v":0},{"$f":"(D65*$H$7)+(C65*$H$6)+(E65*$H$8)","v":0},{"$f":"IFERROR(($K65+$L65)*($G65+$H65*$J65/100)/$I65,0)","v":0},{"$f":"$K65+$L65-$M65","v":0},null,null,null,{"$f":"Constants!$D79","v":0},{"$f":"SUMIF($O$14:$O$103,$P164,$V$14:$V$103)","v":0},{"$f":"(D65*$R$7)+(C65*$R$6)+(E65*$R$8)","v":0},{"$f":"IFERROR(($S65+$T65)*($G65+$H65*$R65/100)/$I65,0)","v":0},{"$f":"$S65+$T65-$U65","v":0}]
[]
[]
[null,null,null,null,"TOTAL IMPERVIOUS COVER TREATED (ac)",{"$f":"SUM(E14:E65)","v":0},"AREA CHECK:",{"$f":"IF(F68>$F$8,\"AREA EXCEEDED!\",\"OK.\")","v":"OK."}]
[null,null,null,null,"TOTAL MIXED OPEN TREATED (ac)",{"$f":"SUM(C14:C65)","v":0},"AREA CHECK:",{"$f":"IF(F69>$F$6,\"AREA EXCEEDED!\",\"OK.\")","v":"OK."}]
[null,null,null,null,"TOTAL MANAGED TURF AREA TREATED (ac)",{"$f":"SUM(D33:D65)","v":0},"AREA CHECK:",{"$f":"IF(F70>$F$7,\"AREA EXCEEDED!\",\"OK.\")","v":"OK."}]
[null,null,null,null,"TOTAL RUNOFF REDUCTION IN D.A. C (ft3)",{"$f":"IFERROR(SUM($G$14:$G$65),0)","v":0}]
[]
[null,null,null,null,null,null,null,"TOTAL PHOSPHORUS AVAILABLE FOR REMOVAL IN D.A. C (lb/yr)",{"$f":"$N$8","v":0},null,null,null,null,null,null,null,null,null,null,null,null,"TOTAL RUNOFF REDUCTION IN D.A. C (ft3)",{"$f":"F71","v":0}]
[null,null,null,null,null,null,null,"TOTAL PHOSPHORUS REMOVED WITH RUNOFF REDUCTION PRACTICES IN D.A. C (lb/yr)",{"$f":"IFERROR(SUM(M14:M65),0)","v":0},null,null,null,null,null,null,null,null,null,null,null,null,"NITROGEN REMOVED WITH RUNOFF REDUCTION PRACTICES IN D.A. C (lb/yr)",{"$f":"SUM($U$14:$U$65)","v":0}]
[null,null,null,null,null,null,null,"TOTAL PHOSPHORUS REMAINING AFTER APPLYING RUNOFF REDUCTION PRACTICES IN D.A. C (lb/yr)",{"$f":"I73-I74","v":0}]
[null,null,null,null,null,null,null,null,null,null,null,null,null,null,null,null,null,null,null,null,null,null,"           SEE WATER QUALITY COMPLIANCE TAB FOR SITE CALCULATIONS (Information Only)"]
[null,null,"SEE WATER QUALITY COMPLIANCE TAB FOR SITE COMPLIANCE CALCULATIONS"]
[]
[]
[]
[]
["12. Wet Swale (no RR)",null,null,null,null,null,null,null,null,null,null,null,null,null,null,null,null,"12. Wet Swale (Coastal Plain) (no RR)"]
["12.a. Wet Swale #1 (P-CNV-03)",{"$f":"Constants!$B82","v":0},null,null,null,{"$f":"SUMIF($O$14:$O$103,P165,$H$14:$H$103)","v":0},{"$f":"(Constants!$B$2*($G$7*$D83+$G$8*$E83+$C83*$G$6)*3630+$F83)*$B83/100","v":0},{"$f":"(Constants!$B$2*($G$7*$D83+$G$8*$E83+$C83*$G$6)*3630+$F83)*(1-$B83/100)","v":0},{"$f":"+$G83+$H83","v":0},{"$f":"Constants!C82","v":20},{"$f":"SUMIF($O$13:$O$103,P165,$N$13:$N$103)","v":0},{"$f":"(D83*$H$7)+(C83*$H$6)+(E83*$H$8)","v":0},{"$f":"IFERROR(($K83+$L83)*($G83+$H83*$J83/100)/$I83,0)","v":0},{"$f":"$K83+$L83-$M83","v":0},null,null,null,{"$f":"Constants!$D82","v":25},{"$f":"SUMIF($O$14:$O$103,$P165,$V$14:$V$103)","v":0},{"$f":"(D83*$R$7)+(C83*$R$6)+(E83*$R$8)","v":0},{"$f":"IFERROR(($S83+$T83)*($G83+$H83*$R83/100)/$I83,0)","v":0},{"$f":"$S83+$T83-$U83","v":0}]
["12.b. Wet Swale #2 (P-CNV-03)",{"$f":"Constants!$B83","v":0},null,null,null,{"$f":"SUMIF($O$14:$O$103,P166,$H$14:$H$103)","v":0},{"$f":"(Constants!$B$2*($G$7*$D84+$G$8*$E84+$C84*$G$6)*3630+$F84)*$B84/100","v":0},{"$f":"(Constants!$B$2*($G$7*$D84+$G$8*$E84+$C84*$G$6)*3630+$F84)*(1-$B84/100)","v":0},{"$f":"+$G84+$H84","v":0},{"$f":"Constants!C83","v":40},{"$f":"SUMIF($O$13:$O$103,P166,$N$13:$N$103)","v":0},{"$f":"(D84*$H$7)+(C84*$H$6)+(E84*$H$8)","v":0},{"$f":"IFERROR(($K84+$L84)*($G84+$H84*$J84/100)/$I84,0)","v":0},{"$f":"$K84+$L84-$M84","v":0},null,null,null,{"$f":"Constants!$D83","v":35},{"$f":"SUMIF($O$14:$O$103,$P166,$V$14:$V$103)","v":0},{"$f":"(D84*$R$7)+(C84*$R$6)+(E84*$R$8)","v":0},{"$f":"IFERROR(($S84+$T84)*($G84+$H84*$R84/100)/$I84,0)","v":0},{"$f":"$S84+$T84-$U84","v":0}]
[]
["13.  Filtering Practices (no RR)",null,null,null,null,null,null,null,null,null,null,null,null,null,null,null,null,"13.  Filtering Practices (no RR)"]
["13.a.Filtering Practice #1 (P-FIL-06)",{"$f":"Constants!$B86","v":0},null,null,null,{"$f":"SUMIF($O$14:$O$103,P167,$H$14:$H$103)","v":0},{"$f":"(Constants!$B$2*($G$7*$D87+$G$8*$E87+$C87*$G$6)*3630+$F87)*$B87/100","v":0},{"$f":"(Constants!$B$2*($G$7*$D87+$G$8*$E87+$C87*$G$6)*3630+$F87)*(1-$B87/100)","v":0},{"$f":"+$G87+$H87","v":0},{"$f":"Constants!C86","v":60},{"$f":"SUMIF($O$13:$O$103,P167,$N$13:$N$103)","v":0},{"$f":"(D87*$H$7)+(C87*$H$6)+(E87*$H$8)","v":0},{"$f":"IFERROR(($K87+$L87)*($G87+$H87*$J87/100)/$I87,0)","v":0},{"$f":"$K87+$L87-$M87","v":0},null,null,null,{"$f":"Constants!$D86","v":30},{"$f":"SUMIF($O$14:$O$103,$P167,$V$14:$V$103)","v":0},{"$f":"(D87*$R$7)+(C87*$R$6)+(E87*$R$8)","v":0},{"$f":"IFERROR(($S87+$T87)*($G87+$H87*$R87/100)/$I87,0)","v":0},{"$f":"$S87+$T87-$U87","v":0}]
["13.b. Filtering Practice #2 (P-FIL-06)",{"$f":"Constants!$B87","v":0},null,null,null,{"$f":"SUMIF($O$14:$O$103,P168,$H$14:$H$103)","v":0},{"$f":"(Constants!$B$2*($G$7*$D88+$G$8*$E88+$C88*$G$6)*3630+$F88)*$B88/100","v":0},{"$f":"(Constants!$B$2*($G$7*$D88+$G$8*$E88+$C88*$G$6)*3630+$F88)*(1-$B88/100)","v":0},{"$f":"+$G88+$H88","v":0},{"$f":"Constants!C87","v":65},{"$f":"SUMIF($O$13:$O$103,P168,$N$13:$N$103)","v":0},{"$f":"(D88*$H$7)+(C88*$H$6)+(E88*$H$8)","v":0},{"$f":"IFERROR(($K88+$L88)*($G88+$H88*$J88/100)/$I88,0)","v":0},{"$f":"$K88+$L88-$M88","v":0},null,null,null,{"$f":"Constants!$D87","v":45},{"$f":"SUMIF($O$14:$O$103,$P168,$V$14:$V$103)","v":0},{"$f":"(D88*$R$7)+(C88*$R$6)+(E88*$R$8)","v":0},{"$f":"IFERROR(($S88+$T88)*($G88+$H88*$R88/100)/$I88,0)","v":0},{"$f":"$S88+$T88-$U88","v":0}]
[]
["14. Constructed Wetland (no RR)",null,null,null,null,null,null,null,null,null,null,null,null,null,null,null,null,"14. Constructed Wetland (no RR)"]
["14.a.Constructed Wetland #1 (P-BAS-01)",{"$f":"Constants!$B90","v":0},null,null,null,{"$f":"SUMIF($O$14:$O$103,P169,$H$14:$H$103)","v":0},{"$f":"(Constants!$B$2*($G$7*$D91+$G$8*$E91+$C91*$G$6)*3630+$F91)*$B91/100","v":0},{"$f":"(Constants!$B$2*($G$7*$D91+$G$8*$E91+$C91*$G$6)*3630+$F91)*(1-$B91/100)","v":0},{"$f":"+$G91+$H91","v":0},{"$f":"Constants!C90","v":50},{"$f":"SUMIF($O$13:$O$103,P169,$N$13:$N$103)","v":0},{"$f":"(D91*$H$7)+(C91*$H$6)+(E91*$H$8)","v":0},{"$f":"IFERROR(($K91+$L91)*($G91+$H91*$J91/100)/$I91,0)","v":0},{"$f":"$K91+$L91-$M91","v":0},null,null,null,{"$f":"Constants!$D90","v":25},{"$f":"SUMIF($O$14:$O$103,$P169,$V$14:$V$103)","v":0},{"$f":"(D91*$R$7)+(C91*$R$6)+(E91*$R$8)","v":0},{"$f":"IFERROR(($S91+$T91)*($G91+$H91*$R91/100)/$I91,0)","v":0},{"$f":"$S91+$T91-$U91","v":0}]
["14.b. Constructed Wetland #2 (P-BAS-01)",{"$f":"Constants!$B91","v":0},null,null,null,{"$f":"SUMIF($O$14:$O$103,P170,$H$14:$H$103)","v":0},{"$f":"(Constants!$B$2*($G$7*$D92+$G$8*$E92+$C92*$G$6)*3630+$F92)*$B92/100","v":0},{"$f":"(Constants!$B$2*($G$7*$D92+$G$8*$E92+$C92*$G$6)*3630+$F92)*(1-$B92/100)","v":0},{"$f":"+$G92+$H92","v":0},{"$f":"Constants!C91","v":75},{"$f":"SUMIF($O$13:$O$103,P170,$N$13:$N$103)","v":0},{"$f":"(D92*$H$7)+(C92*$H$6)+(E92*$H$8)","v":0},{"$f":"IFERROR(($K92+$L92)*($G92+$H92*$J92/100)/$I92,0)","v":0},{"$f":"$K92+$L92-$M92","v":0},null,null,null,{"$f":"Constants!$D91","v":55},{"$f":"SUMIF($O$14:$O$103,$P170,$V$14:$V$103)","v":0},{"$f":"(D92*$R$7)+(C92*$R$6)+(E92*$R$8)","v":0},{"$f":"IFERROR(($S92+$T92)*($G92+$H92*$R92/100)/$I92,0)","v":0},{"$f":"$S92+$T92-$U92","v":0}]
[]
["15. Wet Ponds (no RR)",null,null,null,null,null,null,null,null,null,null,null,null,null,null,null,null,"15. Wet Ponds (no RR)"]
["15.a. Wet Pond #1 (P-BAS-02)",{"$f":"Constants!$B94","v":0},null,null,null,{"$f":"SUMIF($O$14:$O$103,P171,$H$14:$H$103)","v":0},{"$f":"(Constants!$B$2*($G$7*$D95+$G$8*$E95+$C95*$G$6)*3630+$F95)*$B95/100","v":0},{"$f":"(Constants!$B$2*($G$7*$D95+$G$8*$E95+$C95*$G$6)*3630+$F95)*(1-$B95/100)","v":0},{"$f":"+$G95+$H95","v":0},{"$f":"Constants!C94","v":50},{"$f":"SUMIF($O$13:$O$103,P171,$N$13:$N$103)","v":0},{"$f":"(D95*$H$7)+(C95*$H$6)+(E95*$H$8)","v":0},{"$f":"IFERROR(($K95+$L95)*($G95+$H95*$J95/100)/$I95,0)","v":0},{"$f":"$K95+$L95-$M95","v":0},null,null,null,{"$f":"Constants!$D94","v":30},{"$f":"SUMIF($O$14:$O$103,$P171,$V$14:$V$103)","v":0},{"$f":"(D95*$R$7)+(C95*$R$6)+(E95*$R$8)","v":0},{"$f":"IFERROR(($S95+$T95)*($G95+$H95*$R95/100)/$I95,0)","v":0},{"$f":"$S95+$T95-$U95","v":0}]
["15.b. Wet Pond #1 (Coastal Plain) (P-BAS-02)",{"$f":"Constants!$B95","v":0},null,null,null,{"$f":"SUMIF($O$14:$O$103,P172,$H$14:$H$103)","v":0},{"$f":"(Constants!$B$2*($G$7*$D96+$G$8*$E96+$C96*$G$6)*3630+$F96)*$B96/100","v":0},{"$f":"(Constants!$B$2*($G$7*$D96+$G$8*$E96+$C96*$G$6)*3630+$F96)*(1-$B96/100)","v":0},{"$f":"+$G96+$H96","v":0},{"$f":"Constants!C95","v":45},{"$f":"SUMIF($O$13:$O$103,P172,$N$13:$N$103)","v":0},{"$f":"(D96*$H$7)+(C96*$H$6)+(E96*$H$8)","v":0},{"$f":"IFERROR(($K96+$L96)*($G96+$H96*$J96/100)/$I96,0)","v":0},{"$f":"$K96+$L96-$M96","v":0},null,null,null,{"$f":"Constants!$D95","v":20},{"$f":"SUMIF($O$14:$O$103,$P172,$V$14:$V$103)","v":0},{"$f":"(D96*$R$7)+(C96*$R$6)+(E96*$R$8)","v":0},{"$f":"IFERROR(($S96+$T96)*($G96+$H96*$R96/100)/$I96,0)","v":0},{"$f":"$S96+$T96-$U96","v":0}]
["15.c. Wet Pond #2 (P-BAS-02)",{"$f":"Constants!$B96","v":0},null,null,null,{"$f":"SUMIF($O$14:$O$103,P173,$H$14:$H$103)","v":0},{"$f":"(Constants!$B$2*($G$7*$D97+$G$8*$E97+$C97*$G$6)*3630+$F97)*$B97/100","v":0},{"$f":"(Constants!$B$2*($G$7*$D97+$G$8*$E97+$C97*$G$6)*3630+$F97)*(1-$B97/100)","v":0},{"$f":"+$G97+$H97","v":0},{"$f":"Constants!C96","v":75},{"$f":"SUMIF($O$13:$O$103,P173,$N$13:$N$103)","v":0},{"$f":"(D97*$H$7)+(C97*$H$6)+(E97*$H$8)","v":0},{"$f":"IFERROR(($K97+$L97)*($G97+$H97*$J97/100)/$I97,0)","v":0},{"$f":"$K97+$L97-$M97","v":0},null,null,null,{"$f":"Constants!$D96","v":40},{"$f":"SUMIF($O$14:$O$103,$P173,$V$14:$V$103)","v":0},{"$f":"(D97*$R$7)+(C97*$R$6)+(E97*$R$8)","v":0},{"$f":"IFERROR(($S97+$T97)*($G97+$H97*$R97/100)/$I97,0)","v":0},{"$f":"$S97+$T97-$U97","v":0}]
["15.d. Wet Pond #2 (Coastal Plain) (P-BAS-02)",{"$f":"Constants!$B97","v":0},null,null,null,{"$f":"SUMIF($O$14:$O$103,P174,$H$14:$H$103)","v":0},{"$f":"(Constants!$B$2*($G$7*$D98+$G$8*$E98+$C98*$G$6)*3630+$F98)*$B98/100","v":0},{"$f":"(Constants!$B$2*($G$7*$D98+$G$8*$E98+$C98*$G$6)*3630+$F98)*(1-$B98/100)","v":0},{"$f":"+$G98+$H98","v":0},{"$f":"Constants!C97","v":65},{"$f":"SUMIF($O$13:$O$103,P174,$N$13:$N$103)","v":0},{"$f":"(D98*$H$7)+(C98*$H$6)+(E98*$H$8)","v":0},{"$f":"IFERROR(($K98+$L98)*($G98+$H98*$J98/100)/$I98,0)","v":0},{"$f":"$K98+$L98-$M98","v":0},null,null,null,{"$f":"Constants!$D97","v":30},{"$f":"SUMIF($O$14:$O$103,$P174,$V$14:$V$103)","v":0},{"$f":"(D98*$R$7)+(C98*$R$6)+(E98*$R$8)","v":0},{"$f":"IFERROR(($S98+$T98)*($G98+$H98*$R98/100)/$I98,0)","v":0},{"$f":"$S98+$T98-$U98","v":0}]
[]
["16. Manufactured Treatment Devices (no RR)",null,null,null,null,null,null,null,null,null,null,null,null,null,null,null,null,"16. Manufactured BMP (no RR)"]
["16.a. Manufactured Treatment Device-Hydrodynamic",{"$f":"Constants!$B100","v":0},null,null,null,{"$f":"SUMIF($O$14:$O$103,P175,$H$14:$H$103)","v":0},{"$f":"(Constants!$B$2*($G$7*$D101+$G$8*$E101+$C101*$G$6)*3630+$F101)*$B101/100","v":0},{"$f":"(Constants!$B$2*($G$7*$D101+$G$8*$E101+$C101*$G$6)*3630+$F101)*(1-$B101/100)","v":0},{"$f":"+$G101+$H101","v":0},20,{"$f":"SUMIF($O$13:$O$103,P175,$N$13:$N$103)","v":0},{"$f":"(D101*$H$7)+(C101*$H$6)+(E101*$H$8)","v":0},{"$f":"IFERROR(($K101+$L101)*($G101+$H101*$J101/100)/$I101,0)","v":0},{"$f":"$K101+$L101-$M101","v":0},null,null,null,0,{"$f":"SUMIF($O$14:$O$103,$P175,$V$14:$V$103)","v":0},{"$f":"(D101*$R$7)+(C101*$R$6)+(E101*$R$8)","v":0},{"$f":"IFERROR(($S101+$T101)*($G101+$H101*$R101/100)/$I101,0)","v":0},{"$f":"$S101+$T101-$U101","v":0}]
["16.b. Manufactured Treatment Device-Filtering",{"$f":"Constants!$B101","v":0},null,null,null,{"$f":"SUMIF($O$14:$O$103,P176,$H$14:$H$103)","v":0},{"$f":"(Constants!$B$2*($G$7*$D102+$G$8*$E102+$C102*$G$6)*3630+$F102)*$B102/100","v":0},{"$f":"(Constants!$B$2*($G$7*$D102+$G$8*$E102+$C102*$G$6)*3630+$F102)*(1-$B102/100)","v":0},{"$f":"+$G102+$H102","v":0},20,{"$f":"SUMIF($O$13:$O$103,P176,$N$13:$N$103)","v":0},{"$f":"(D102*$H$7)+(C102*$H$6)+(E102*$H$8)","v":0},{"$f":"IFERROR(($K102+$L102)*($G102+$H102*$J102/100)/$I102,0)","v":0},{"$f":"$K102+$L102-$M102","v":0},null,null,null,0,{"$f":"SUMIF($O$14:$O$103,$P176,$V$14:$V$103)","v":0},{"$f":"(D102*$R$7)+(C102*$R$6)+(E102*$R$8)","v":0},{"$f":"IFERROR(($S102+$T102)*($G102+$H102*$R102/100)/$I102,0)","v":0},{"$f":"$S102+$T102-$U102","v":0}]
["16.c. Manufactured Treatment Device-Generic",{"$f":"Constants!$B102","v":0},null,null,null,{"$f":"SUMIF($O$14:$O$103,P177,$H$14:$H$103)","v":0},{"$f":"(Constants!$B$2*($G$7*$D103+$G$8*$E103+$C103*$G$6)*3630+$F103)*$B103/100","v":0},{"$f":"(Constants!$B$2*($G$7*$D103+$G$8*$E103+$C103*$G$6)*3630+$F103)*(1-$B103/100)","v":0},{"$f":"+$G103+$H103","v":0},20,{"$f":"SUMIF($O$13:$O$103,P177,$N$13:$N$103)","v":0},{"$f":"(D103*$H$7)+(C103*$H$6)+(E103*$H$8)","v":0},{"$f":"IFERROR(($K103+$L103)*($G103+$H103*$J103/100)/$I103,0)","v":0},{"$f":"$K103+$L103-$M103","v":0},null,null,null,0,{"$f":"SUMIF($O$14:$O$103,$P177,$V$14:$V$103)","v":0},{"$f":"(D103*$R$7)+(C103*$R$6)+(E103*$R$8)","v":0},{"$f":"IFERROR(($S103+$T103)*($G103+$H103*$R103/100)/$I103,0)","v":0},{"$f":"$S103+$T103-$U103","v":0}]
[]
[]
[]
[null,null,null,null,"TOTAL IMPERVIOUS COVER TREATED (ac)",{"$f":"SUM($E$14:$E$103)","v":0},"AREA CHECK:",{"$f":"IF($F$107>$F$8,\"AREA EXCEEDED!\",\"OK.\")","v":"OK."}]
[null,null,null,null,"TOTAL MIXED OPEN TREATED (ac)",{"$f":"SUM($C$14:$C$103)","v":0},"AREA CHECK:",{"$f":"IF($F$108>$F$6,\"AREA EXCEEDED!\",\"OK.\")","v":"OK."}]
[null,null,null,null,"TOTAL MANAGED TURF AREA TREATED (ac)",{"$f":"SUM($D$14:$D$103)","v":0},"AREA CHECK:",{"$f":"IF($F$109>$F$7,\"AREA EXCEEDED!\",\"OK.\")","v":"OK."}]
[]
[null,null,null,null,null,null,null,"TOTAL PHOSPHORUS REMOVAL REQUIRED ON SITE (lb/yr)",{"$f":"IF(Site!$E$21=\"Check Areas!\",\"ERROR - \",Site!$E$21)","v":0},{"$f":"IF(I111=\"ERROR - \",\"Site Data Tab\",\"\")","v":""}]
[]
[null,null,null,null,null,null,null,"TOTAL PHOSPHORUS AVAILABLE FOR REMOVAL IN D.A. C (lb/yr)",{"$f":"$N$8","v":0}]
[null,null,null,null,null,null,null,"TOTAL PHOSPHORUS REMOVED WITHOUT RUNOFF REDUCTION PRACTICES IN D.A. C (lb/yr)",{"$f":"SUM($M$83:$M$103)","v":0}]
[null,null,null,null,null,null,null,"TOTAL PHOSPHORUS REMOVED WITH RUNOFF REDUCTION PRACTICES IN D.A. C (lb/yr)",{"$f":"$I$74","v":0}]
[null,null,null,null,null,null,null,"TOTAL PHOSPHORUS LOAD REDUCTION ACHIEVED IN D.A. C (lb/yr)",{"$f":"$I$114+$I$115","v":0}]
[null,null,null,null,null,null,null,"TOTAL PHOSPHORUS REMAINING AFTER APPLYING BMP LOAD REDUCTIONS IN D.A. C (lb/yr)",{"$f":"$I$113-$I$116","v":0}]
[]
[null,null,"SEE WATER QUALITY COMPLIANCE TAB FOR SITE COMPLIANCE CALCULATIONS"]
[]
[null,null,null,null,null,null,null,"NITROGEN REMOVED WITH RUNOFF REDUCTION PRACTICES IN D.A. C (lb/yr)",{"$f":"IFERROR(SUM($U$14:$U$65),0)","v":0}]
[null,null,null,null,null,null,null,"NITROGEN REMOVED WITHOUT RUNOFF REDUCTION PRACTICES IN D.A. C (lb/yr)",{"$f":"SUM($U$83:$U$103)","v":0}]
[null,null,null,null,null,null,null,"TOTAL NITROGEN REMOVED IN D.A. C (lb/yr)",{"$f":"$I$121+$I$122","v":0}]
[]
[]
[]
[]
[]
[]
[]
[null,null,"Downstream Practices - Dropdown selections for each applicable BMP"]
[]
["Options for 1. Green Roof",null,"Options for 2. Impervious Surface Disconnection",null,"Options for 3a. Pervious Parking, A/B Soils",null,"Options for 4a. Grass Channels, A/B Soils",null,null,"Options for 4b. Grass Channels, C/D Soils"]
[null,null,null,null,null,null,null,null,null,null,null,"Options for 4.c. Grass Channel Compost Amended Soils",null,null,null,"Master Downstream BMP Reference List"]
[{"$f":"P135","v":"None"},null,{"$f":"P135","v":"None"},null,{"$f":"P135","v":"None"},null,{"$f":"P135","v":"None"},null,null,{"$f":"P135","v":"None"},null,null,null,null,null,"None"]
["2.a. Simple Disconnection to A/B Soils",null,{"$f":"P146","v":"4.a. Grass Channel A/B Soils"},null,{"$f":"P146","v":"4.a. Grass Channel A/B Soils"},null,{"$f":"P147","v":"4.b. Grass Channel C/D Soils"},null,null,{"$f":"P146","v":"4.a. Grass Channel A/B Soils"},null,{"$f":"P135","v":"None"},null,null,null,"2.a. Simple Disconnection to A/B Soils"]
["2.b. Simple Disconnection to C/D Soils",null,"4.b. Grass Channel C/D Soils",null,"4.b. Grass Channel C/D Soils",null,"4.c. Grass Channel Compost Amended Soils",null,null,{"$f":"P148","v":"4.c. Grass Channel Compost Amended Soils"},null,{"$f":"P146","v":"4.a. Grass Channel A/B Soils"},null,null,null,"2.b. Simple Disconnection to C/D Soils"]
["2.c. To Soil Amended Filter Path",null,"4.c. Grass Channel Compost Amended Soils",null,"4.c. Grass Channel Compost Amended Soils",null,"5.a. Dry Swale #1",null,null,"5.a. Dry Swale #1",null,{"$f":"P147","v":"4.b. Grass Channel C/D Soils"},null,null,null,"2.c. To Soil Amended Filter Path"]
["2.d. To Dry Well/French Drain #1 (Micro-Infiltration #1)",null,"5.a. Dry Swale #1",null,"5.a. Dry Swale #1",null,"5.b. Dry Swale #2",null,null,"5.b. Dry Swale #2",null,{"$f":"P149","v":"5.a. Dry Swale #1"},null,null,null,"2.d. To Dry Well/French Drain #1 (Micro-Infiltration #1)"]
["2.e. To Dry Well/French Drain #2 (Micro-Infiltration. #2)",null,"5.b. Dry Swale #2",null,"5.b. Dry Swale #2",null,"6.a. Bioretention #1",null,null,"6.a. Bioretention #1",null,"5.b. Dry Swale #2",null,null,null,"2.e. To Dry Well/French Drain #2 (Micro-Infiltration. #2)"]
["2.f. To Rain Garden #1 (Micro-Bioretention #1)",null,"6.a. Bioretention #1",null,"6.a. Bioretention #1",null,"6.b. Bioretention #2",null,null,"6.b. Bioretention #2",null,"6.a. Bioretention #1",null,null,null,"2.f. To Rain Garden #1 (Micro-Bioretention #1)"]
["2.g. To Rain Garden #2 (Micro-Bioretention #2)",null,"6.b. Bioretention #2",null,"6.b. Bioretention #2",null,"7.a. Infiltration #1",null,null,"7.a. Infiltration #1",null,"6.b. Bioretention #2",null,null,null,"2.g. To Rain Garden #2 (Micro-Bioretention #2)"]
["2.h. To Train Barrel, Rain Tank, or Cistern",null,"7.a. Infiltration #1",null,"7.a. Infiltration #1",null,"7.b. Infiltration #2",null,null,"7.b. Infiltration #2",null,"7.a. Infiltration #1",null,null,null,"2.h. To Train Barrel, Rain Tank, or Cistern"]
["2.i. To Stormwater Planter (Urban Bioretention)",null,"7.b. Infiltration #2",null,"7.b. Infiltration #2",null,"8.a. ED #1",null,null,"8.a. ED #1",null,"7.b. Infiltration #2",null,null,null,"2.i. To Stormwater Planter (Urban Bioretention)"]
["3.a. Permeable Pavement #1",null,"8.a. ED #1",null,"8.a. ED #1",null,"8.b. ED #2",null,null,"8.b. ED #2",null,"8.a. ED #1",null,null,null,"3.a. Permeable Pavement #1"]
["4.a. Grass Channel A/B Soils",null,"8.b. ED #2",null,"8.b. ED #2",null,"9.a. Sheetflow to A/B Soil Conservation Area ",null,null,"9.a. Sheetflow to A/B Soil Conservation Area ",null,"8.b. ED #2",null,null,null,"4.a. Grass Channel A/B Soils"]
["4.b. Grass Channel C/D Soils",null,"9.a. Sheetflow to A/B Soil Conservation Area ",null,"9.a. Sheetflow to A/B Soil Conservation Area ",null,"9.b. Sheetflow to C/D Soil Conservation Area",null,null,"9.b. Sheetflow to C/D Soil Conservation Area",null,"9.a. Sheetflow to A/B Soil Conservation Area ",null,null,null,"4.b. Grass Channel C/D Soils"]
["4.c. Grass Channel Compost Amended Soils",null,"9.b. Sheetflow to C/D Soil Conservation Area",null,"9.b. Sheetflow to C/D Soil Conservation Area",null,"9.c. Sheetflow to Vegetated Filter Strip",null,null,"9.c. Sheetflow to Vegetated Filter Strip",null,"9.b. Sheetflow to C/D Soil Conservation Area",null,null,null,"4.c. Grass Channel Compost Amended Soils"]
["5.a. Dry Swale #1",null,"9.c. Sheetflow to Vegetated Filter Strip",null,"9.c. Sheetflow to Vegetated Filter Strip",null,"10.a. Regenerative Stormwater Conveyance #1",null,null,"10.a. Regenerative Stormwater Conveyance #1",null,"9.c. Sheetflow to Vegetated Filter Strip",null,null,null,"5.a. Dry Swale #1"]
["5.b. Dry Swale #2",null,"10.a. Regenerative Stormwater Conveyance #1",null,"10.a. Regenerative Stormwater Conveyance #1",null,"10.b. Regenerative Stormwater Conveyance #2",null,null,"10.b. Regenerative Stormwater Conveyance #2",null,"10.a. Regenerative Stormwater Conveyance #1",null,null,null,"5.b. Dry Swale #2"]
["6.a. Bioretention #1",null,"10.b. Regenerative Stormwater Conveyance #2",null,"10.b. Regenerative Stormwater Conveyance #2",null,{"$f":"P165","v":"12.a. Wet Swale #1"},null,null,{"$f":"P165","v":"12.a. Wet Swale #1"},null,"10.b. Regenerative Stormwater Conveyance #2",null,null,null,"6.a. Bioretention #1"]
["6.b. Bioretention #2",null,{"$f":"P165","v":"12.a. Wet Swale #1"},null,{"$f":"P165","v":"12.a. Wet Swale #1"},null,"12.b. Wet Swale #2",null,null,"12.b. Wet Swale #2",null,{"$f":"P165","v":"12.a. Wet Swale #1"},null,null,null,"6.b. Bioretention #2"]
["7.a. Infiltration #1",null,"12.b. Wet Swale #2",null,"12.b. Wet Swale #2",null,"13.a. Filtering Practice #1",null,null,"13.a. Filtering Practice #1",null,"12.b. Wet Swale #2",null,null,null,"7.a. Infiltration #1"]
["7.b. Infiltration #2",null,"13.a. Filtering Practice #1",null,"13.a. Filtering Practice #1",null,"13.b. Filtering Practice #2",null,null,"13.b. Filtering Practice #2",null,"13.a. Filtering Practice #1",null,null,null,"7.b. Infiltration #2"]
["8.a. ED #1",null,"13.b. Filtering Practice #2",null,"13.b. Filtering Practice #2",null,"14.a. Constructed Wetland #1",null,null,"14.a. Constructed Wetland #1",null,"13.b. Filtering Practice #2",null,null,null,"8.a. ED #1"]
["8.b. ED #2",null,"14.a. Constructed Wetland #1",null,"14.a. Constructed Wetland #1",null,"14.b. Constructed Wetland #2",null,null,"14.b. Constructed Wetland #2",null,"14.a. Constructed Wetland #1",null,null,null,"8.b. ED #2"]
["9.a. Sheetflow to A/B Soil Conservation Area ",null,"14.b. Constructed Wetland #2",null,"14.b. Constructed Wetland #2",null,"15.a. Wet Pond #1",null,null,"15.a. Wet Pond #1",null,"14.b. Constructed Wetland #2",null,null,null,"9.a. Sheetflow to A/B Soil Conservation Area "]
["9.b. Sheetflow to C/D Soil Conservation Area",null,"15.a. Wet Pond #1",null,"15.a. Wet Pond #1",null,"15.b. Wet Pond #1 (Coastal Plain)",null,null,"15.b. Wet Pond #1 (Coastal Plain)",null,"15.a. Wet Pond #1",null,null,null,"9.b. Sheetflow to C/D Soil Conservation Area"]
["9.c. Sheetflow to Vegetated Filter Strip",null,"15.b. Wet Pond #1 (Coastal Plain)",null,"15.b. Wet Pond #1 (Coastal Plain)",null,"15.c. Wet Pond #2",null,null,"15.c. Wet Pond #2",null,"15.b. Wet Pond #1 (Coastal Plain)",null,null,null,"9.c. Sheetflow to Vegetated Filter Strip"]
["10.a. Regenerative Stormwater Conveyance #1",null,"15.c. Wet Pond #2",null,"15.c. Wet Pond #2",null,"15.d. Wet Pond #2 (Coastal Plain)",null,null,"15.d. Wet Pond #2 (Coastal Plain)",null,"15.c. Wet Pond #2",null,null,null,"10.a. Regenerative Stormwater Conveyance #1"]
["10.b. Regenerative Stormwater Conveyance #2",null,"15.d. Wet Pond #2 (Coastal Plain)",null,"15.d. Wet Pond #2 (Coastal Plain)",null,"16.a. MTD - Hydrodynamic",null,null,"16.a. MTD - Hydrodynamic",null,"15.d. Wet Pond #2 (Coastal Plain)",null,null,null,"10.b. Regenerative Stormwater Conveyance #2"]
[{"$f":"P165","v":"12.a. Wet Swale #1"},null,"16.a. MTD - Hydrodynamic",null,"16.a. MTD - Hydrodynamic",null,"16.b. MTD - Filtering",null,null,"16.b. MTD - Filtering",null,"16.a. MTD - Hydrodynamic",null,null,null,"11.a. Trees over Pervious, A/B"]
["12.b. Wet Swale #2",null,"16.b. MTD - Filtering",null,"16.b. MTD - Filtering",null,"16.c. MTD - Generic",null,null,"16.c. MTD - Generic",null,"16.b. MTD - Filtering",null,null,null,"11.b. Trees over Pervious, B/C"]
["13.a. Filtering Practice #1",null,"16.c. MTD - Generic",null,"16.c. MTD - Generic",null,null,null,null,null,null,"16.c. MTD - Generic",null,null,null,"11.c. Trees over Impervious"]
["13.b. Filtering Practice #2",null,null,null,null,null,null,null,null,null,null,null,null,null,null,"12.a. Wet Swale #1"]
["14.a. Constructed Wetland #1",null,null,null,null,null,null,null,null,null,null,null,null,null,null,"12.b. Wet Swale #2"]
["14.b. Constructed Wetland #2",null,null,null,null,null,null,null,null,null,null,null,null,null,null,"13.a. Filtering Practice #1"]
["15.a. Wet Pond #1",null,null,null,null,null,null,null,null,null,null,null,null,null,null,"13.b. Filtering Practice #2"]
["15.b. Wet Pond #1 (Coastal Plain)",null,null,null,null,null,null,null,null,null,null,null,null,null,null,"14.a. Constructed Wetland #1"]
["15.c. Wet Pond #2",null,null,null,null,null,null,null,null,null,null,null,null,null,null,"14.b. Constructed Wetland #2"]
["15.d. Wet Pond #2 (Coastal Plain)",null,null,null,null,null,null,null,null,null,null,null,null,null,null,"15.a. Wet Pond #1"]
["16.a. MTD - Hydrodynamic",null,null,null,null,null,null,null,null,null,null,null,null,null,null,"15.b. Wet Pond #1 (Coastal Plain)"]
["16.b. MTD - Filtering",null,null,null,null,null,null,null,null,null,null,null,null,null,null,"15.c. Wet Pond #2"]
["16.c. MTD - Generic",null,null,null,null,null,null,null,null,null,null,null,null,null,null,"15.d. Wet Pond #2 (Coastal Plain)"]
[null,null,null,null,null,null,null,null,null,null,null,null,null,null,null,"16.a. MTD - Hydrodynamic"]
["Options for 5a. Dry Swale #1",null,"Options for 5b. Dry Swale #2",null,"Options for 6a. Bioretention #1",null,"Options for 6b. Bioretention #2",null,null,"Options for 7a. Infiltration #1",null,"Options for 7b. Infiltration #2",null,null,null,"16.b. MTD - Filtering"]
[null,null,null,null,null,null,null,null,null,null,null,null,null,null,null,"16.c. MTD - Generic"]
[{"$f":"P135","v":"None"},null,{"$f":"P135","v":"None"},null,{"$f":"P135","v":"None"},null,{"$f":"P135","v":"None"},null,null,{"$f":"P135","v":"None"},null,{"$f":"P135","v":"None"}]
[{"$f":"P146","v":"4.a. Grass Channel A/B Soils"},null,{"$f":"P146","v":"4.a. Grass Channel A/B Soils"},null,{"$f":"P146","v":"4.a. Grass Channel A/B Soils"},null,{"$f":"P146","v":"4.a. Grass Channel A/B Soils"},null,null,{"$f":"P146","v":"4.a. Grass Channel A/B Soils"},null,{"$f":"P146","v":"4.a. Grass Channel A/B Soils"}]
[{"$f":"P147","v":"4.b. Grass Channel C/D Soils"},null,{"$f":"P147","v":"4.b. Grass Channel C/D Soils"},null,{"$f":"P147","v":"4.b. Grass Channel C/D Soils"},null,"4.b. Grass Channel C/D Soils",null,null,"4.b. Grass Channel C/D Soils",null,"4.b. Grass Channel C/D Soils"]
[{"$f":"P148","v":"4.c. Grass Channel Compost Amended Soils"},null,{"$f":"P148","v":"4.c. Grass Channel Compost Amended Soils"},null,{"$f":"P148","v":"4.c. Grass Channel Compost Amended Soils"},null,"4.c. Grass Channel Compost Amended Soils",null,null,"4.c. Grass Channel Compost Amended Soils",null,"4.c. Grass Channel Compost Amended Soils"]
[{"$f":"P150","v":"5.b. Dry Swale #2"},null,{"$f":"P149","v":"5.a. Dry Swale #1"},null,{"$f":"P149","v":"5.a. Dry Swale #1"},null,"5.a. Dry Swale #1",null,null,"5.a. Dry Swale #1",null,"5.a. Dry Swale #1"]
["6.a. Bioretention #1",null,{"$f":"P151","v":"6.a. Bioretention #1"},null,{"$f":"P150","v":"5.b. Dry Swale #2"},null,"5.b. Dry Swale #2",null,null,"5.b. Dry Swale #2",null,"5.b. Dry Swale #2"]
["6.b. Bioretention #2",null,"6.b. Bioretention #2",null,{"$f":"P152","v":"6.b. Bioretention #2"},null,"6.a. Bioretention #1",null,null,"6.a. Bioretention #1",null,"6.a. Bioretention #1"]
["7.a. Infiltration #1",null,"7.a. Infiltration #1",null,"7.a. Infiltration #1",null,{"$f":"P153","v":"7.a. Infiltration #1"},null,null,"6.b. Bioretention #2",null,"6.b. Bioretention #2"]
["7.b. Infiltration #2",null,"7.b. Infiltration #2",null,"7.b. Infiltration #2",null,"7.b. Infiltration #2",null,null,{"$f":"P154","v":"7.b. Infiltration #2"},null,"7.a. Infiltration #1"]
["8.a. ED #1",null,"8.a. ED #1",null,"8.a. ED #1",null,"8.a. ED #1",null,null,"8.a. ED #1",null,{"$f":"P155","v":"8.a. ED #1"}]
["8.b. ED #2",null,"8.b. ED #2",null,"8.b. ED #2",null,"8.b. ED #2",null,null,"8.b. ED #2",null,"8.b. ED #2"]
["9.a. Sheetflow to A/B Soil Conservation Area ",null,"9.a. Sheetflow to A/B Soil Conservation Area ",null,"9.a. Sheetflow to A/B Soil Conservation Area ",null,"9.a. Sheetflow to A/B Soil Conservation Area ",null,null,"9.a. Sheetflow to A/B Soil Conservation Area ",null,"9.a. Sheetflow to A/B Soil Conservation Area "]
["9.b. Sheetflow to C/D Soil Conservation Area",null,"9.b. Sheetflow to C/D Soil Conservation Area",null,"9.b. Sheetflow to C/D Soil Conservation Area",null,"9.b. Sheetflow to C/D Soil Conservation Area",null,null,"9.b. Sheetflow to C/D Soil Conservation Area",null,"9.b. Sheetflow to C/D Soil Conservation Area"]
["9.c. Sheetflow to Vegetated Filter Strip",null,"9.c. Sheetflow to Vegetated Filter Strip",null,"9.c. Sheetflow to Vegetated Filter Strip",null,"9.c. Sheetflow to Vegetated Filter Strip",null,null,"9.c. Sheetflow to Vegetated Filter Strip",null,"9.c. Sheetflow to Vegetated Filter Strip"]
["10.a. Regenerative Stormwater Conveyance #1",null,"10.a. Regenerative Stormwater Conveyance #1",null,"10.a. Regenerative Stormwater Conveyance #1",null,"10.a. Regenerative Stormwater Conveyance #1",null,null,"10.a. Regenerative Stormwater Conveyance #1",null,"10.a. Regenerative Stormwater Conveyance #1"]
["10.b. Regenerative Stormwater Conveyance #2",null,"10.b. Regenerative Stormwater Conveyance #2",null,"10.b. Regenerative Stormwater Conveyance #2",null,"10.b. Regenerative Stormwater Conveyance #2",null,null,"10.b. Regenerative Stormwater Conveyance #2",null,"10.b. Regenerative Stormwater Conveyance #2"]
[{"$f":"P165","v":"12.a. Wet Swale #1"},null,{"$f":"P165","v":"12.a. Wet Swale #1"},null,{"$f":"P165","v":"12.a. Wet Swale #1"},null,{"$f":"P165","v":"12.a. Wet Swale #1"},null,null,{"$f":"P165","v":"12.a. Wet Swale #1"},null,{"$f":"P165","v":"12.a. Wet Swale #1"}]
["12.b. Wet Swale #2",null,"12.b. Wet Swale #2",null,"12.b. Wet Swale #2",null,"12.b. Wet Swale #2",null,null,"12.b. Wet Swale #2",null,"12.b. Wet Swale #2"]
["13.a. Filtering Practice #1",null,"13.a. Filtering Practice #1",null,"13.a. Filtering Practice #1",null,"13.a. Filtering Practice #1",null,null,"13.a. Filtering Practice #1",null,"13.a. Filtering Practice #1"]
["13.b. Filtering Practice #2",null,"13.b. Filtering Practice #2",null,"13.b. Filtering Practice #2",null,"13.b. Filtering Practice #2",null,null,"13.b. Filtering Practice #2",null,"13.b. Filtering Practice #2"]
["14.a. Constructed Wetland #1",null,"14.a. Constructed Wetland #1",null,"14.a. Constructed Wetland #1",null,"14.a. Constructed Wetland #1",null,null,"14.a. Constructed Wetland #1",null,"14.a. Constructed Wetland #1"]
["14.b. Constructed Wetland #2",null,"14.b. Constructed Wetland #2",null,"14.b. Constructed Wetland #2",null,"14.b. Constructed Wetland #2",null,null,"14.b. Constructed Wetland #2",null,"14.b. Constructed Wetland #2"]
["15.a. Wet Pond #1",null,"15.a. Wet Pond #1",null,"15.a. Wet Pond #1",null,"15.a. Wet Pond #1",null,null,"15.a. Wet Pond #1",null,"15.a. Wet Pond #1"]
["15.b. Wet Pond #1 (Coastal Plain)",null,"15.b. Wet Pond #1 (Coastal Plain)",null,"15.b. Wet Pond #1 (Coastal Plain)",null,"15.b. Wet Pond #1 (Coastal Plain)",null,null,"15.b. Wet Pond #1 (Coastal Plain)",null,"15.b. Wet Pond #1 (Coastal Plain)"]
["15.c. Wet Pond #2",null,"15.c. Wet Pond #2",null,"15.c. Wet Pond #2",null,"15.c. Wet Pond #2",null,null,"15.c. Wet Pond #2",null,"15.c. Wet Pond #2"]
["15.d. Wet Pond #2 (Coastal Plain)",null,"15.d. Wet Pond #2 (Coastal Plain)",null,"15.d. Wet Pond #2 (Coastal Plain)",null,"15.d. Wet Pond #2 (Coastal Plain)",null,null,"15.d. Wet Pond #2 (Coastal Plain)",null,"15.d. Wet Pond #2 (Coastal Plain)"]
["16.a. MTD - Hydrodynamic",null,"16.a. MTD - Hydrodynamic",null,"16.a. MTD - Hydrodynamic",null,"16.a. MTD - Hydrodynamic",null,null,"16.a. MTD - Hydrodynamic",null,"16.a. MTD - Hydrodynamic"]
["16.b. MTD - Filtering",null,"16.b. MTD - Filtering",null,"16.b. MTD - Filtering",null,"16.b. MTD - Filtering",null,null,"16.b. MTD - Filtering",null,"16.b. MTD - Filtering"]
["16.c. MTD - Generic",null,"16.c. MTD - Generic",null,"16.c. MTD - Generic",null,"16.c. MTD - Generic",null,null,"16.c. MTD - Generic",null,"16.c. MTD - Generic"]
[]
["Options for 8a. Extended Detention #1",null,"Options for 8b. Extended Detention #2",null,"Options for 9 Sheet Flow to Open Space",null,"Options for 9c. Sheet Flow to Filter Strip",null,null,"Options for 10a. Wet Swale #1",null,"Options for 10b. Wet Swale #2"]
[]
[{"$f":"P135","v":"None"},null,{"$f":"P135","v":"None"},null,{"$f":"P135","v":"None"},null,{"$f":"P135","v":"None"},null,null,{"$f":"P135","v":"None"},null,{"$f":"P135","v":"None"}]
[{"$f":"P146","v":"4.a. Grass Channel A/B Soils"},null,{"$f":"P146","v":"4.a. Grass Channel A/B Soils"},null,null,null,{"$f":"P146","v":"4.a. Grass Channel A/B Soils"},null,null,{"$f":"P146","v":"4.a. Grass Channel A/B Soils"},null,{"$f":"P146","v":"4.a. Grass Channel A/B Soils"}]
["4.b. Grass Channel C/D Soils",null,"4.b. Grass Channel C/D Soils",null,null,null,"4.b. Grass Channel C/D Soils",null,null,"4.b. Grass Channel C/D Soils",null,"4.b. Grass Channel C/D Soils"]
["4.c. Grass Channel Compost Amended Soils",null,"4.c. Grass Channel Compost Amended Soils",null,null,null,"4.c. Grass Channel Compost Amended Soils",null,null,"4.c. Grass Channel Compost Amended Soils",null,"4.c. Grass Channel Compost Amended Soils"]
["5.a. Dry Swale #1",null,"5.a. Dry Swale #1",null,null,null,"5.a. Dry Swale #1",null,null,"5.a. Dry Swale #1",null,"5.a. Dry Swale #1"]
["5.b. Dry Swale #2",null,"5.b. Dry Swale #2",null,null,null,"5.b. Dry Swale #2",null,null,"5.b. Dry Swale #2",null,"5.b. Dry Swale #2"]
["6.a. Bioretention #1",null,"6.a. Bioretention #1",null,null,null,"6.a. Bioretention #1",null,null,"6.a. Bioretention #1",null,"6.a. Bioretention #1"]
["6.b. Bioretention #2",null,"6.b. Bioretention #2",null,null,null,"6.b. Bioretention #2",null,null,"6.b. Bioretention #2",null,"6.b. Bioretention #2"]
["7.a. Infiltration #1",null,"7.a. Infiltration #1",null,null,null,"7.a. Infiltration #1",null,null,"7.a. Infiltration #1",null,"7.a. Infiltration #1"]
["7.b. Infiltration #2",null,"7.b. Infiltration #2",null,null,null,"7.b. Infiltration #2",null,null,"7.b. Infiltration #2",null,"7.b. Infiltration #2"]
[{"$f":"P156","v":"8.b. ED #2"},null,"8.a. ED #1",null,null,null,"8.a. ED #1",null,null,"8.a. ED #1",null,"8.a. ED #1"]
["9.a. Sheetflow to A/B Soil Conservation Area ",null,{"$f":"P157","v":"9.a. Sheetflow to A/B Soil Conservation Area "},null,null,null,"8.b. ED #2",null,null,"8.b. ED #2",null,"8.b. ED #2"]
["9.b. Sheetflow to C/D Soil Conservation Area",null,"9.b. Sheetflow to C/D Soil Conservation Area",null,null,null,"9.a. Sheetflow to A/B Soil Conservation Area ",null,null,"9.a. Sheetflow to A/B Soil Conservation Area ",null,"9.a. Sheetflow to A/B Soil Conservation Area "]
["9.c. Sheetflow to Vegetated Filter Strip",null,"9.c. Sheetflow to Vegetated Filter Strip",null,null,null,"9.b. Sheetflow to C/D Soil Conservation Area",null,null,"9.b. Sheetflow to C/D Soil Conservation Area",null,"9.b. Sheetflow to C/D Soil Conservation Area"]
["10.a. Regenerative Stormwater Conveyance #1",null,"10.a. Regenerative Stormwater Conveyance #1",null,null,null,{"$f":"P160","v":"10.a. Regenerative Stormwater Conveyance #1"},null,null,"9.c. Sheetflow to Vegetated Filter Strip",null,"9.c. Sheetflow to Vegetated Filter Strip"]
["10.b. Regenerative Stormwater Conveyance #2",null,"10.b. Regenerative Stormwater Conveyance #2",null,null,null,{"$f":"P161","v":"10.b. Regenerative Stormwater Conveyance #2"},null,null,"10.a. Regenerative Stormwater Conveyance #1",null,"10.a. Regenerative Stormwater Conveyance #1"]
[{"$f":"P165","v":"12.a. Wet Swale #1"},null,{"$f":"P165","v":"12.a. Wet Swale #1"},null,null,null,{"$f":"P165","v":"12.a. Wet Swale #1"},null,null,"10.b. Regenerative Stormwater Conveyance #2",null,"10.b. Regenerative Stormwater Conveyance #2"]
["12.b. Wet Swale #2",null,"12.b. Wet Swale #2",null,null,null,"12.b. Wet Swale #2",null,null,{"$f":"P166","v":"12.b. Wet Swale #2"},null,{"$f":"P165","v":"12.a. Wet Swale #1"}]
["13.a. Filtering Practice #1",null,"13.a. Filtering Practice #1",null,null,null,"13.a. Filtering Practice #1",null,null,"13.a. Filtering Practice #1",null,{"$f":"P167","v":"13.a. Filtering Practice #1"}]
["13.b. Filtering Practice #2",null,"13.b. Filtering Practice #2",null,null,null,"13.b. Filtering Practice #2",null,null,"13.b. Filtering Practice #2",null,"13.b. Filtering Practice #2"]
["14.a. Constructed Wetland #1",null,"14.a. Constructed Wetland #1",null,null,null,"14.a. Constructed Wetland #1",null,null,"14.a. Constructed Wetland #1",null,"14.a. Constructed Wetland #1"]
["14.b. Constructed Wetland #2",null,"14.b. Constructed Wetland #2",null,null,null,"14.b. Constructed Wetland #2",null,null,"14.b. Constructed Wetland #2",null,"14.b. Constructed Wetland #2"]
["15.a. Wet Pond #1",null,"15.a. Wet Pond #1",null,null,null,"15.a. Wet Pond #1",null,null,"15.a. Wet Pond #1",null,"15.a. Wet Pond #1"]
["15.b. Wet Pond #1 (Coastal Plain)",null,"15.b. Wet Pond #1 (Coastal Plain)",null,null,null,"15.b. Wet Pond #1 (Coastal Plain)",null,null,"15.b. Wet Pond #1 (Coastal Plain)",null,"15.b. Wet Pond #1 (Coastal Plain)"]
["15.c. Wet Pond #2",null,"15.c. Wet Pond #2",null,null,null,"15.c. Wet Pond #2",null,null,"15.c. Wet Pond #2",null,"15.c. Wet Pond #2"]
["15.d. Wet Pond #2 (Coastal Plain)",null,"15.d. Wet Pond #2 (Coastal Plain)",null,null,null,"15.d. Wet Pond #2 (Coastal Plain)",null,null,"15.d. Wet Pond #2 (Coastal Plain)",null,"15.d. Wet Pond #2 (Coastal Plain)"]
["16.a. MTD - Hydrodynamic",null,"16.a. MTD - Hydrodynamic",null,null,null,"16.a. MTD - Hydrodynamic",null,null,"16.a. MTD - Hydrodynamic",null,"16.a. MTD - Hydrodynamic"]
["16.b. MTD - Filtering",null,"16.b. MTD - Filtering",null,null,null,"16.b. MTD - Filtering",null,null,"16.b. MTD - Filtering",null,"16.b. MTD - Filtering"]
["16.c. MTD - Generic",null,"16.c. MTD - Generic",null,null,null,"16.c. MTD - Generic",null,null,"16.c. MTD - Generic",null,"16.c. MTD - Generic"]
[]
[]
[]
["Options for 11 A.  Filtering Practice #1",null,"Options for 11 b.  Filtering Practice #2",null,"Options for 12.a.  Constructed Wetland #1",null,"Options for 12.b.  Constructed Wetland #2",null,null,"Options for 13.a.  Wet Pond #1",null,"Options for 13.b.  Wet Pond #1 (Coastal Plain)"]
[null,null,null,null,null,null,null,null,null,{"$f":"P135","v":"None"},null,{"$f":"P135","v":"None"}]
[{"$f":"P135","v":"None"},null,{"$f":"P135","v":"None"},null,{"$f":"P135","v":"None"},null,{"$f":"P135","v":"None"},null,null,{"$f":"P146","v":"4.a. Grass Channel A/B Soils"},null,{"$f":"P146","v":"4.a. Grass Channel A/B Soils"}]
[{"$f":"P146","v":"4.a. Grass Channel A/B Soils"},null,{"$f":"P146","v":"4.a. Grass Channel A/B Soils"},null,{"$f":"P146","v":"4.a. Grass Channel A/B Soils"},null,{"$f":"P146","v":"4.a. Grass Channel A/B Soils"},null,null,"4.b. Grass Channel C/D Soils",null,"4.b. Grass Channel C/D Soils"]
["4.b. Grass Channel C/D Soils",null,"4.b. Grass Channel C/D Soils",null,"4.b. Grass Channel C/D Soils",null,"4.b. Grass Channel C/D Soils",null,null,"4.c. Grass Channel Compost Amended Soils",null,"4.c. Grass Channel Compost Amended Soils"]
["4.c. Grass Channel Compost Amended Soils",null,"4.c. Grass Channel Compost Amended Soils",null,"4.c. Grass Channel Compost Amended Soils",null,"4.c. Grass Channel Compost Amended Soils",null,null,"5.a. Dry Swale #1",null,"5.a. Dry Swale #1"]
["5.a. Dry Swale #1",null,"5.a. Dry Swale #1",null,"5.a. Dry Swale #1",null,"5.a. Dry Swale #1",null,null,"5.b. Dry Swale #2",null,"5.b. Dry Swale #2"]
["5.b. Dry Swale #2",null,"5.b. Dry Swale #2",null,"5.b. Dry Swale #2",null,"5.b. Dry Swale #2",null,null,"6.a. Bioretention #1",null,"6.a. Bioretention #1"]
["6.a. Bioretention #1",null,"6.a. Bioretention #1",null,"6.a. Bioretention #1",null,"6.a. Bioretention #1",null,null,"6.b. Bioretention #2",null,"6.b. Bioretention #2"]
["6.b. Bioretention #2",null,"6.b. Bioretention #2",null,"6.b. Bioretention #2",null,"6.b. Bioretention #2",null,null,"7.a. Infiltration #1",null,"7.a. Infiltration #1"]
["7.a. Infiltration #1",null,"7.a. Infiltration #1",null,"7.a. Infiltration #1",null,"7.a. Infiltration #1",null,null,"7.b. Infiltration #2",null,"7.b. Infiltration #2"]
["7.b. Infiltration #2",null,"7.b. Infiltration #2",null,"7.b. Infiltration #2",null,"7.b. Infiltration #2",null,null,"8.a. ED #1",null,"8.a. ED #1"]
["8.a. ED #1",null,"8.a. ED #1",null,"8.a. ED #1",null,"8.a. ED #1",null,null,"8.b. ED #2",null,"8.b. ED #2"]
["8.b. ED #2",null,"8.b. ED #2",null,"8.b. ED #2",null,"8.b. ED #2",null,null,"9.a. Sheetflow to A/B Soil Conservation Area ",null,"9.a. Sheetflow to A/B Soil Conservation Area "]
["9.a. Sheetflow to A/B Soil Conservation Area ",null,"9.a. Sheetflow to A/B Soil Conservation Area ",null,"9.a. Sheetflow to A/B Soil Conservation Area ",null,"9.a. Sheetflow to A/B Soil Conservation Area ",null,null,"9.b. Sheetflow to C/D Soil Conservation Area",null,"9.b. Sheetflow to C/D Soil Conservation Area"]
["9.b. Sheetflow to C/D Soil Conservation Area",null,"9.b. Sheetflow to C/D Soil Conservation Area",null,"9.b. Sheetflow to C/D Soil Conservation Area",null,"9.b. Sheetflow to C/D Soil Conservation Area",null,null,"9.c. Sheetflow to Vegetated Filter Strip",null,"9.c. Sheetflow to Vegetated Filter Strip"]
["9.c. Sheetflow to Vegetated Filter Strip",null,"9.c. Sheetflow to Vegetated Filter Strip",null,"9.c. Sheetflow to Vegetated Filter Strip",null,"9.c. Sheetflow to Vegetated Filter Strip",null,null,"10.a. Regenerative Stormwater Conveyance #1",null,"10.a. Regenerative Stormwater Conveyance #1"]
[{"$f":"P165","v":"12.a. Wet Swale #1"},null,"10.a. Regenerative Stormwater Conveyance #1",null,"10.a. Regenerative Stormwater Conveyance #1",null,"10.a. Regenerative Stormwater Conveyance #1",null,null,"10.b. Regenerative Stormwater Conveyance #2",null,"10.b. Regenerative Stormwater Conveyance #2"]
[{"$f":"P166","v":"12.b. Wet Swale #2"},null,"10.b. Regenerative Stormwater Conveyance #2",null,"10.b. Regenerative Stormwater Conveyance #2",null,"10.b. Regenerative Stormwater Conveyance #2",null,null,{"$f":"P165","v":"12.a. Wet Swale #1"},null,{"$f":"P165","v":"12.a. Wet Swale #1"}]
[{"$f":"P168","v":"13.b. Filtering Practice #2"},null,{"$f":"P165","v":"12.a. Wet Swale #1"},null,{"$f":"P165","v":"12.a. Wet Swale #1"},null,{"$f":"P165","v":"12.a. Wet Swale #1"},null,null,"12.b. Wet Swale #2",null,"12.b. Wet Swale #2"]
["14.a. Constructed Wetland #1",null,{"$f":"P166","v":"12.b. Wet Swale #2"},null,{"$f":"P166","v":"12.b. Wet Swale #2"},null,{"$f":"P166","v":"12.b. Wet Swale #2"},null,null,"13.a. Filtering Practice #1",null,"13.a. Filtering Practice #1"]
["14.b. Constructed Wetland #2",null,{"$f":"P167","v":"13.a. Filtering Practice #1"},null,{"$f":"P167","v":"13.a. Filtering Practice #1"},null,{"$f":"P167","v":"13.a. Filtering Practice #1"},null,null,"13.b. Filtering Practice #2",null,"13.b. Filtering Practice #2"]
["15.a. Wet Pond #1",null,{"$f":"P169","v":"14.a. Constructed Wetland #1"},null,{"$f":"P168","v":"13.b. Filtering Practice #2"},null,{"$f":"P168","v":"13.b. Filtering Practice #2"},null,null,"14.a. Constructed Wetland #1",null,"14.a. Constructed Wetland #1"]
["15.b. Wet Pond #1 (Coastal Plain)",null,"14.b. Constructed Wetland #2",null,{"$f":"P170","v":"14.b. Constructed Wetland #2"},null,{"$f":"P169","v":"14.a. Constructed Wetland #1"},null,null,"14.b. Constructed Wetland #2",null,"14.b. Constructed Wetland #2"]
["15.c. Wet Pond #2",null,"15.a. Wet Pond #1",null,"15.a. Wet Pond #1",null,{"$f":"P171","v":"15.a. Wet Pond #1"},null,null,{"$f":"P173","v":"15.c. Wet Pond #2"},null,{"$f":"P174","v":"15.d. Wet Pond #2 (Coastal Plain)"}]
["15.d. Wet Pond #2 (Coastal Plain)",null,"15.b. Wet Pond #1 (Coastal Plain)",null,"15.b. Wet Pond #1 (Coastal Plain)",null,"15.b. Wet Pond #1 (Coastal Plain)",null,null,{"$f":"P175","v":"16.a. MTD - Hydrodynamic"},null,{"$f":"P175","v":"16.a. MTD - Hydrodynamic"}]
["16.a. MTD - Hydrodynamic",null,"15.c. Wet Pond #2",null,"15.c. Wet Pond #2",null,"15.c. Wet Pond #2",null,null,{"$f":"P176","v":"16.b. MTD - Filtering"},null,{"$f":"P176","v":"16.b. MTD - Filtering"}]
["16.b. MTD - Filtering",null,"15.d. Wet Pond #2 (Coastal Plain)",null,"15.d. Wet Pond #2 (Coastal Plain)",null,"15.d. Wet Pond #2 (Coastal Plain)",null,null,{"$f":"P177","v":"16.c. MTD - Generic"},null,{"$f":"P177","v":"16.c. MTD - Generic"}]
["16.c. MTD - Generic",null,"16.a. MTD - Hydrodynamic",null,"16.a. MTD - Hydrodynamic",null,"16.a. MTD - Hydrodynamic"]
[null,null,"16.b. MTD - Filtering",null,"16.b. MTD - Filtering",null,"16.b. MTD - Filtering"]
[null,null,"16.c. MTD - Generic",null,"16.c. MTD - Generic",null,"16.c. MTD - Generic"]
[]
[]
[]
["Options for 13.c.  Wet Pond #2",null,"Options for 13.d.  Wet Pond #2 (Coastal Plain)",null,"Options for 14.a.  Manufactured Device-Hydrodynamic",null,"Options for 14.b.  Manufactured Device-Filtering",null,null,null,"Options for 14.c.  Manufactured Device-Generic"]
[]
[{"$f":"P135","v":"None"},null,{"$f":"P135","v":"None"},null,{"$f":"P135","v":"None"},null,{"$f":"P135","v":"None"},null,null,null,{"$f":"P135","v":"None"}]
[{"$f":"P146","v":"4.a. Grass Channel A/B Soils"},null,{"$f":"P146","v":"4.a. Grass Channel A/B Soils"},null,{"$f":"P146","v":"4.a. Grass Channel A/B Soils"},null,{"$f":"P146","v":"4.a. Grass Channel A/B Soils"},null,null,null,{"$f":"P146","v":"4.a. Grass Channel A/B Soils"}]
["4.b. Grass Channel C/D Soils",null,"4.b. Grass Channel C/D Soils",null,"4.b. Grass Channel C/D Soils",null,"4.b. Grass Channel C/D Soils",null,null,null,"4.b. Grass Channel C/D Soils"]
["4.c. Grass Channel Compost Amended Soils",null,"4.c. Grass Channel Compost Amended Soils",null,"4.c. Grass Channel Compost Amended Soils",null,"4.c. Grass Channel Compost Amended Soils",null,null,null,"4.c. Grass Channel Compost Amended Soils"]
["5.a. Dry Swale #1",null,"5.a. Dry Swale #1",null,"5.a. Dry Swale #1",null,"5.a. Dry Swale #1",null,null,null,"5.a. Dry Swale #1"]
["5.b. Dry Swale #2",null,"5.b. Dry Swale #2",null,"5.b. Dry Swale #2",null,"5.b. Dry Swale #2",null,null,null,"5.b. Dry Swale #2"]
["6.a. Bioretention #1",null,"6.a. Bioretention #1",null,"6.a. Bioretention #1",null,"6.a. Bioretention #1",null,null,null,"6.a. Bioretention #1"]
["6.b. Bioretention #2",null,"6.b. Bioretention #2",null,"6.b. Bioretention #2",null,"6.b. Bioretention #2",null,null,null,"6.b. Bioretention #2"]
["7.a. Infiltration #1",null,"7.a. Infiltration #1",null,"7.a. Infiltration #1",null,"7.a. Infiltration #1",null,null,null,"7.a. Infiltration #1"]
["7.b. Infiltration #2",null,"7.b. Infiltration #2",null,"7.b. Infiltration #2",null,"7.b. Infiltration #2",null,null,null,"7.b. Infiltration #2"]
["8.a. ED #1",null,"8.a. ED #1",null,"8.a. ED #1",null,"8.a. ED #1",null,null,null,"8.a. ED #1"]
["8.b. ED #2",null,"8.b. ED #2",null,"8.b. ED #2",null,"8.b. ED #2",null,null,null,"8.b. ED #2"]
["9.a. Sheetflow to A/B Soil Conservation Area ",null,"9.a. Sheetflow to A/B Soil Conservation Area ",null,"9.a. Sheetflow to A/B Soil Conservation Area ",null,"9.a. Sheetflow to A/B Soil Conservation Area ",null,null,null,"9.a. Sheetflow to A/B Soil Conservation Area "]
["9.b. Sheetflow to C/D Soil Conservation Area",null,"9.b. Sheetflow to C/D Soil Conservation Area",null,"9.b. Sheetflow to C/D Soil Conservation Area",null,"9.b. Sheetflow to C/D Soil Conservation Area",null,null,null,"9.b. Sheetflow to C/D Soil Conservation Area"]
["9.c. Sheetflow to Vegetated Filter Strip",null,"9.c. Sheetflow to Vegetated Filter Strip",null,"9.c. Sheetflow to Vegetated Filter Strip",null,"9.c. Sheetflow to Vegetated Filter Strip",null,null,null,"9.c. Sheetflow to Vegetated Filter Strip"]
["10.a. Regenerative Stormwater Conveyance #1",null,"10.a. Regenerative Stormwater Conveyance #1",null,"10.a. Regenerative Stormwater Conveyance #1",null,"10.a. Regenerative Stormwater Conveyance #1",null,null,null,"10.a. Regenerative Stormwater Conveyance #1"]
["10.b. Regenerative Stormwater Conveyance #2",null,"10.b. Regenerative Stormwater Conveyance #2",null,"10.b. Regenerative Stormwater Conveyance #2",null,"10.b. Regenerative Stormwater Conveyance #2",null,null,null,"10.b. Regenerative Stormwater Conveyance #2"]
[{"$f":"P165","v":"12.a. Wet Swale #1"},null,{"$f":"P165","v":"12.a. Wet Swale #1"},null,{"$f":"P165","v":"12.a. Wet Swale #1"},null,{"$f":"P165","v":"12.a. Wet Swale #1"},null,null,null,{"$f":"P165","v":"12.a. Wet Swale #1"}]
["12.b. Wet Swale #2",null,"12.b. Wet Swale #2",null,"12.b. Wet Swale #2",null,"12.b. Wet Swale #2",null,null,null,"12.b. Wet Swale #2"]
["13.a. Filtering Practice #1",null,"13.a. Filtering Practice #1",null,"13.a. Filtering Practice #1",null,"13.a. Filtering Practice #1",null,null,null,"13.a. Filtering Practice #1"]
["13.b. Filtering Practice #2",null,"13.b. Filtering Practice #2",null,"13.b. Filtering Practice #2",null,"13.b. Filtering Practice #2",null,null,null,"13.b. Filtering Practice #2"]
["14.a. Constructed Wetland #1",null,"14.a. Constructed Wetland #1",null,"14.a. Constructed Wetland #1",null,"14.a. Constructed Wetland #1",null,null,null,"14.a. Constructed Wetland #1"]
["14.b. Constructed Wetland #2",null,"14.b. Constructed Wetland #2",null,"14.b. Constructed Wetland #2",null,"14.b. Constructed Wetland #2",null,null,null,"14.b. Constructed Wetland #2"]
["15.a. Wet Pond #1",null,{"$f":"P172","v":"15.b. Wet Pond #1 (Coastal Plain)"},null,"15.a. Wet Pond #1",null,"15.a. Wet Pond #1",null,null,null,"15.a. Wet Pond #1"]
[{"$f":"P175","v":"16.a. MTD - Hydrodynamic"},null,{"$f":"P175","v":"16.a. MTD - Hydrodynamic"},null,"15.b. Wet Pond #1 (Coastal Plain)",null,"15.b. Wet Pond #1 (Coastal Plain)",null,null,null,"15.b. Wet Pond #1 (Coastal Plain)"]
[{"$f":"P176","v":"16.b. MTD - Filtering"},null,{"$f":"P176","v":"16.b. MTD - Filtering"},null,"15.c. Wet Pond #2",null,"15.c. Wet Pond #2",null,null,null,"15.c. Wet Pond #2"]
[{"$f":"P177","v":"16.c. MTD - Generic"},null,{"$f":"P177","v":"16.c. MTD - Generic"},null,"15.d. Wet Pond #2 (Coastal Plain)",null,"15.d. Wet Pond #2 (Coastal Plain)",null,null,null,"15.d. Wet Pond #2 (Coastal Plain)"]
[null,null,null,null,{"$f":"P176","v":"16.b. MTD - Filtering"}]
[]
[]
[]
["Options for 10.a. Regenerative Stormwater Conveyance #1",null,"Options for 10.b. Regenerative Stormwater Conveyance #1",null,null,null,"Options for 11.a. Trees over Pervious, A/B",null,null,null,"Options for 11.b. Trees over Pervious, C/D",null,null,"Options for 11.c. Trees over Impervious"]
[]
[{"$f":"P135","v":"None"},null,{"$f":"P135","v":"None"},null,null,null,{"$f":"P135","v":"None"},null,null,null,{"$f":"P135","v":"None"},null,null,{"$f":"P135","v":"None"}]
[null,null,null,null,null,null,{"$f":"P146","v":"4.a. Grass Channel A/B Soils"},null,null,null,{"$f":"P146","v":"4.a. Grass Channel A/B Soils"},null,null,{"$f":"P146","v":"4.a. Grass Channel A/B Soils"}]
[null,null,null,null,null,null,{"$f":"P147","v":"4.b. Grass Channel C/D Soils"},null,null,null,{"$f":"P147","v":"4.b. Grass Channel C/D Soils"},null,null,{"$f":"P147","v":"4.b. Grass Channel C/D Soils"}]
[null,null,null,null,null,null,{"$f":"P148","v":"4.c. Grass Channel Compost Amended Soils"},null,null,null,{"$f":"P148","v":"4.c. Grass Channel Compost Amended Soils"},null,null,"4.c. Grass Channel Compost Amended Soils"]
[null,null,null,null,null,null,"5.a. Dry Swale #1",null,null,null,"5.a. Dry Swale #1",null,null,"5.a. Dry Swale #1"]
[null,null,null,null,null,null,"5.b. Dry Swale #2",null,null,null,"5.b. Dry Swale #2",null,null,"5.b. Dry Swale #2"]
[null,null,null,null,null,null,"6.a. Bioretention #1",null,null,null,"6.a. Bioretention #1",null,null,"6.a. Bioretention #1"]
[null,null,null,null,null,null,"6.b. Bioretention #2",null,null,null,"6.b. Bioretention #2",null,null,"6.b. Bioretention #2"]
[null,null,null,null,null,null,"7.a. Infiltration #1",null,null,null,"7.a. Infiltration #1",null,null,"7.a. Infiltration #1"]
[null,null,null,null,null,null,"7.b. Infiltration #2",null,null,null,"7.b. Infiltration #2",null,null,"7.b. Infiltration #2"]
[null,null,null,null,null,null,"8.a. ED #1",null,null,null,"8.a. ED #1",null,null,"8.a. ED #1"]
[null,null,null,null,null,null,"8.b. ED #2",null,null,null,"8.b. ED #2",null,null,"8.b. ED #2"]
[null,null,null,null,null,null,"9.a. Sheetflow to A/B Soil Conservation Area ",null,null,null,"9.a. Sheetflow to A/B Soil Conservation Area ",null,null,"9.a. Sheetflow to A/B Soil Conservation Area "]
[null,null,null,null,null,null,"9.b. Sheetflow to C/D Soil Conservation Area",null,null,null,"9.b. Sheetflow to C/D Soil Conservation Area",null,null,"9.b. Sheetflow to C/D Soil Conservation Area"]
[null,null,null,null,null,null,"9.c. Sheetflow to Vegetated Filter Strip",null,null,null,"9.c. Sheetflow to Vegetated Filter Strip",null,null,"9.c. Sheetflow to Vegetated Filter Strip"]
[null,null,null,null,null,null,"10.a. Regenerative Stormwater Conveyance #1",null,null,null,"10.a. Regenerative Stormwater Conveyance #1",null,null,"10.a. Regenerative Stormwater Conveyance #1"]
[null,null,null,null,null,null,"10.b. Regenerative Stormwater Conveyance #2",null,null,null,"10.b. Regenerative Stormwater Conveyance #2",null,null,"10.b. Regenerative Stormwater Conveyance #2"]
[null,null,null,null,null,null,{"$f":"P165","v":"12.a. Wet Swale #1"},null,null,null,{"$f":"P165","v":"12.a. Wet Swale #1"},null,null,{"$f":"P165","v":"12.a. Wet Swale #1"}]
[null,null,null,null,null,null,{"$f":"P166","v":"12.b. Wet Swale #2"},null,null,null,{"$f":"P166","v":"12.b. Wet Swale #2"},null,null,{"$f":"P166","v":"12.b. Wet Swale #2"}]
[null,null,null,null,null,null,{"$f":"P167","v":"13.a. Filtering Practice #1"},null,null,null,{"$f":"P167","v":"13.a. Filtering Practice #1"},null,null,"13.a. Filtering Practice #1"]
[null,null,null,null,null,null,"13.b. Filtering Practice #2",null,null,null,"13.b. Filtering Practice #2",null,null,"13.b. Filtering Practice #2"]
[null,null,null,null,null,null,"14.a. Constructed Wetland #1",null,null,null,"14.a. Constructed Wetland #1",null,null,"14.a. Constructed Wetland #1"]
[null,null,null,null,null,null,"14.b. Constructed Wetland #2",null,null,null,"14.b. Constructed Wetland #2",null,null,"14.b. Constructed Wetland #2"]
[null,null,null,null,null,null,"15.a. Wet Pond #1",null,null,null,"15.a. Wet Pond #1",null,null,"15.a. Wet Pond #1"]
[null,null,null,null,null,null,"15.b. Wet Pond #1 (Coastal Plain)",null,null,null,"15.b. Wet Pond #1 (Coastal Plain)",null,null,"15.b. Wet Pond #1 (Coastal Plain)"]
[null,null,null,null,null,null,"15.c. Wet Pond #2",null,null,null,"15.c. Wet Pond #2",null,null,"15.c. Wet Pond #2"]
[null,null,null,null,null,null,"15.d. Wet Pond #2 (Coastal Plain)",null,null,null,"15.d. Wet Pond #2 (Coastal Plain)",null,null,"15.d. Wet Pond #2 (Coastal Plain)"]
[null,null,null,null,null,null,"16.a. MTD - Hydrodynamic",null,null,null,"16.a. MTD - Hydrodynamic",null,null,"16.a. MTD - Hydrodynamic"]
[null,null,null,null,null,null,"16.b. MTD - Filtering",null,null,null,"16.b. MTD - Filtering",null,null,"16.b. MTD - Filtering"]
[null,null,null,null,null,null,"16.c. MTD - Generic",null,null,null,"16.c. MTD - Generic",null,null,"16.c. MTD - Generic"]

{"sheet":"D.A. D","index":6,"n_rows":340,"n_cols":24,"rows_kept":340,"cut":false,"hidden":false,"merged":[[64,14,64,15],[100,14,100,15],[101,14,101,15],[102,14,102,15],[91,14,91,15],[94,14,94,15],[95,14,95,15],[96,14,96,15],[97,14,97,15],[99,0,99,1],[80,16,80,17],[82,14,82,15],[83,14,83,15],[86,14,86,15],[87,14,87,15],[90,14,90,15],[80,1,80,2],[55,14,55,15],[58,14,58,15],[59,14,59,15],[62,14,62,15],[63,14,63,15],[54,14,54,15],[33,14,33,15],[34,14,34,15],[37,14,37,15],[38,14,38,15],[41,14,41,15],[42,14,42,15],[45,14,45,15],[46,14,46,15],[49,14,49,15],[50,14,50,15],[53,14,53,15],[32,14,32,15],[17,14,17,15],[18,14,18,15],[19,14,19,15],[20,14,20,15],[21,14,21,15],[22,14,22,15],[23,14,23,15],[24,14,24,15],[25,14,25,15],[28,14,28,15],[29,14,29,15],[14,14,14,15],[0,3,0,4],[7,9,7,12],[8,9,8,12],[11,14,11,15],[13,14,13,15],[10,14,10,15]]}
["Drainage Area D",null,null,null,null,null,null,null,null,null,null,null,null,"VRRM 4.1, 2024"]
[]
["Drainage Area D Land Cover  (acres)"]
[null,"A Soils","B Soils","C Soils","D Soils","Totals","Land Cover Rv","Composite Loading P",null,null,null,null,null,null,null,null,null,"Composite Loading N"]
["Forest (acres)",null,null,null,null,{"$f":"SUMIF(B5:E5,\">=0\")","v":0},{"$f":"IF(F5>0,(B5*Constants!$B$7+C5*Constants!$C$7+D5*Constants!$D$7+E5*Constants!$E$7)/F5,0)","v":0},{"$f":"IF(G5>0,(B5*Constants!$B14/F5)+(C5*Constants!$C14/F5)+(D5*Constants!$D14/F5)+(E5*Constants!$E14/F5),0)","v":0},null,null,null,null,null,null,null,null,null,{"$f":"IF(G5>0,(B5*Constants!$B21/F5)+(C5*Constants!$C21/F5)+(D5*Constants!$D21/F5)+(E5*Constants!$E21/F5),0)","v":0}]
["Mixed Open (acres)",null,null,null,null,{"$f":"SUMIF(B6:E6,\">=0\")","v":0},{"$f":"IF(F6>0,(B6*Constants!$B$8+C6*Constants!$C$8+D6*Constants!$D$8+E6*Constants!$E$8)/F6,0)","v":0},{"$f":"IF(G6>0,(B6*Constants!$B15/F6)+(C6*Constants!$C15/F6)+(D6*Constants!$D15/F6)+(E6*Constants!$E15/F6),0)","v":0},null,null,null,null,null,null,null,null,null,{"$f":"IF(G6>0,(B6*Constants!$B22/F6)+(C6*Constants!$C22/F6)+(D6*Constants!$D22/F6)+(E6*Constants!$E22/F6),0)","v":0}]
["Managed Turf (acres)",null,null,null,null,{"$f":"SUMIF(B7:E7,\">=0\")","v":0},{"$f":"IF(F7>0,(B7*Constants!$B$9+C7*Constants!$C$9+D7*Constants!$D$9+E7*Constants!$E$9)/F7,0)","v":0},{"$f":"IF(G7>0,(B7*Constants!$B16/F7)+(C7*Constants!$C16/F7)+(D7*Constants!$D16/F7)+(E7*Constants!$E16/F7),0)","v":0},null,null,null,null,null,null,null,null,null,{"$f":"IF(G7>0,(B7*Constants!$B23/F7)+(C7*Constants!$C23/F7)+(D7*Constants!$D23/F7)+(E7*Constants!$E23/F7),0)","v":0}]
["Impervious Cover (acres) ",null,null,null,null,{"$f":"SUMIF(B8:E8,\">=0\")","v":0},{"$f":"IF(F8>0,(B8*Constants!$B$10+C8*Constants!$C$10+D8*Constants!$D$10+E8*Constants!$E$10)/F8,0)","v":0},{"$f":"IF(G8>0,(B8*Constants!$B17/F8)+(C8*Constants!$C17/F8)+(D8*Constants!$D17/F8)+(E8*Constants!$E17/F8),0)","v":0},null,"     Total Phosphorus Available for Removal in D.A. D (lb/yr)",null,null,null,{"$f":"SUMPRODUCT(B6:E8,Constants!B15:E17)","v":0},null,null,null,{"$f":"IF(G8>0,(B8*Constants!$B24/F8)+(C8*Constants!$C24/F8)+(D8*Constants!$D24/F8)+(E8*Constants!$E24/F8),0)","v":0}]
[null,null,null,null,"Total",{"$f":"SUM(F5:F8)","v":0},null,null,null,"Post Development Treatment Volume in D.A. D (ft3)",null,null,null,{"$f":"IFERROR(Constants!$B$2/12*(F7*G7+F8*G8+F6*G6)/(F7+F8+F6)*(F7+F8+F6)*43560,0)","v":0}]
[]
["Stormwater Best Management Practices (RR = Runoff Reduction)",null,null,null,null,null,null,null,null,null,null,null,null,null,"--Select from dropdown lists--"]
["Practice","Runoff Reduction Credit (%)","Mixed Open Credit Area (acres) ","Managed Turf Credit Area (acres) ","Impervious Cover Credit Area (acres)","Volume from Upstream Practice (ft3)","Runoff Reduction (ft3)","Remaining Runoff Volume  (ft3)","Total BMP Treatment Volume (ft3)","Phosphorus Removal Efficiency (%)","Phosphorus Load from Upstream Practices (lb)","Untreated Phosphorus Load to Practice (lb)","Phosphorus Removed By Practice (lb)","Remaining Phosphorus Load (lb)","Downstream Practice to be Employed",null,null,"Nitrogen Removal Efficiency (%)","Nitrogen Load from Upstream  Practices (lbs)","Untreated Nitrogen Load to Practice (lbs)","Nitrogen Removed By Practice (lbs)","Remaining Nitrogen Load (lbs)"]
["1. Vegetated Roof (RR)",null,null,null,null,null,null,null,null,null,null,null,null,null,null,null,null,"1. Vegetated Roof (RR)"]
["1.a. Vegetated Roof #1 (P-FIL-02)",{"$f":"Constants!$B28","v":45},null,null,null,null,{"$f":"(Constants!$B$2*($G$8*$E14)*3630)*$B14/100","v":0},{"$f":"(Constants!$B$2*($G$8*$E14)*3630)*(1-$B14/100)","v":0},{"$f":"+$G14+$H14","v":0},{"$f":"Constants!C28","v":0},null,{"$f":"E14*$H$8","v":0},{"$f":"IFERROR($L14*($G14+$H14*$J14/100)/($I14),0)","v":0},{"$f":"$L14-$M14","v":0},null,null,null,{"$f":"Constants!$D28","v":0},null,{"$f":"E14*$R$8","v":0},{"$f":"IFERROR($T14*($G14+$H14*$R14/100)/$I14,0)","v":0},{"$f":"$T14-$U14","v":0}]
["1.b. Vegetated Roof #2 (P-FIL-02)",{"$f":"Constants!$B29","v":60},null,null,null,null,{"$f":"(Constants!$B$2*($G$8*$E15)*3630)*$B15/100","v":0},{"$f":"(Constants!$B$2*($G$8*$E15)*3630)*(1-$B15/100)","v":0},{"$f":"+$G15+$H15","v":0},{"$f":"Constants!C29","v":0},null,{"$f":"E15*$H$8","v":0},{"$f":"IFERROR($L15*($G15+$H15*$J15/100)/($I15),0)","v":0},{"$f":"$L15-$M15","v":0},null,null,null,{"$f":"Constants!$D29","v":0},null,{"$f":"E15*$R$8","v":0},{"$f":"IFERROR($T15*($G15+$H15*$R15/100)/$I15,0)","v":0},{"$f":"$T15-$U15","v":0}]
[]
["2. Rooftop Disconnection (RR)",null,null,null,null,null,null,null,null,null,null,null,null,null,null,null,null,"2. Rooftop Disconnection (RR)"]
["2.a. Simple Disconnection to A/B Soils \n(P-FIL-01)",{"$f":"Constants!$B32","v":50},null,null,null,{"$f":"SUMIF($O$14:$O$103,P136,$H$14:$H$103)","v":0},{"$f":"(Constants!$B$2*($G$8*$E18)*3630)*$B18/100","v":0},{"$f":"(Constants!$B$2*($G$8*$E18)*3630)*(1-$B18/100)","v":0},{"$f":"+$G18+$H18","v":0},{"$f":"Constants!C32","v":0},{"$f":"SUMIF($O$13:$O$103,P136,$N$13:$N$103)","v":0},{"$f":"E18*$H$8","v":0},{"$f":"IFERROR(($K18+$L18)*($G18+$H18*$J18/100)/$I18,0)","v":0},{"$f":"$K18+$L18-$M18","v":0},null,null,null,{"$f":"Constants!$D32","v":0},{"$f":"SUMIF($O$14:$O$103,$P136,$V$14:$V$103)","v":0},{"$f":"E18*$R$8","v":0},{"$f":"IFERROR(($S18+$T18)*($G18+$H18*$R18/100)/$I18,0)","v":0},{"$f":"$S18+$T18-$U18","v":0}]
["2.b. Simple Disconnection to C/D Soils \n(P-FIL-01)",{"$f":"Constants!$B33","v":25},null,null,null,0,{"$f":"(Constants!$B$2*($G$8*$E19)*3630)*$B19/100","v":0},{"$f":"(Constants!$B$2*($G$8*$E19)*3630)*(1-$B19/100)","v":0},{"$f":"+$G19+$H19","v":0},{"$f":"Constants!C33","v":0},0,{"$f":"E19*$H$8","v":0},{"$f":"IFERROR(($K19+$L19)*($G19+$H19*$J19/100)/$I19,0)","v":0},{"$f":"$K19+$L19-$M19","v":0},null,null,null,{"$f":"Constants!$D33","v":0},0,0,{"$f":"IFERROR(($S19+$T19)*($G19+$H19*$R19/100)/$I19,0)","v":0},{"$f":"$S19+$T19-$U19","v":0}]
["2.c. To Soil Amended Filter Path as per specifications (existing C/D soils) (P-FIL-08)",{"$f":"Constants!$B34","v":50},null,null,null,0,{"$f":"(Constants!$B$2*($G$8*$E20)*3630)*$B20/100","v":0},{"$f":"(Constants!$B$2*($G$8*$E20)*3630)*(1-$B20/100)","v":0},0,{"$f":"Constants!C34","v":0},0,{"$f":"E20*$H$8","v":0},0,0,null,null,null,{"$f":"Constants!$D34","v":0},0,0,0,0]
["2.d. To Dry Well or French Drain #1, \nMicro-Infilration #1 (P-FIL-04)",{"$f":"Constants!$B35","v":50},null,null,null,0,{"$f":"(Constants!$B$2*($G$8*$E21)*3630)*$B21/100","v":0},{"$f":"(Constants!$B$2*($G$8*$E21)*3630)*(1-$B21/100)","v":0},0,{"$f":"Constants!C35","v":25},0,0,0,{"$f":"$K21+$L21-$M21","v":0},null,null,null,{"$f":"Constants!$D35","v":15},0,0,0,0]
["2.e. To Dry Well or French Drain #2, \nMicro-Infiltration #2 (P-FIL-04)",{"$f":"Constants!$B36","v":90},null,null,null,0,{"$f":"(Constants!$B$2*($G$8*$E22)*3630)*$B22/100","v":0},{"$f":"(Constants!$B$2*($G$8*$E22)*3630)*(1-$B22/100)","v":0},0,{"$f":"Constants!C36","v":25},0,0,0,0,null,null,null,{"$f":"Constants!$D36","v":15},0,0,0,0]
["2.f. To Rain Garden #1, \nMicro-Bioretention #1 (P-FIL-05)",{"$f":"Constants!$B37","v":40},null,null,null,0,{"$f":"(Constants!$B$2*($G$8*$E23)*3630)*$B23/100","v":0},{"$f":"(Constants!$B$2*($G$8*$E23)*3630)*(1-$B23/100)","v":0},0,{"$f":"Constants!C37","v":25},0,0,0,0,null,null,null,{"$f":"Constants!$D37","v":40},0,0,0,0]
["2.g. To Rain Garden #2, \nMicro-Bioretention #2 (P-FIL-05)",{"$f":"Constants!$B38","v":80},null,null,null,0,{"$f":"(Constants!$B$2*($G$8*$E24)*3630)*$B24/100","v":0},{"$f":"(Constants!$B$2*($G$8*$E24)*3630)*(1-$B24/100)","v":0},{"$f":"+$G24+$H24","v":0},{"$f":"Constants!C38","v":50},0,0,0,0,null,null,null,{"$f":"Constants!$D38","v":60},0,0,0,0]
["2.h. To Rainwater Harvesting (P-BAS-04)",0,null,null,null,0,{"$f":"(Constants!$B$2*($G$8*$E25)*3630)*$B25/100","v":0},{"$f":"(Constants!$B$2*($G$8*$E25)*3630)*(1-$B25/100)","v":0},0,{"$f":"Constants!C39","v":0},0,0,0,0,null,null,null,{"$f":"Constants!$D39","v":0},0,0,0,0]
["2.i. To Stormwater Planter, \nUrban Bioretention (P-FIL-05)",{"$f":"Constants!$B40","v":40},null,null,null,0,{"$f":"(Constants!$B$2*($G$8*$E26)*3630)*$B26/100","v":0},{"$f":"(Constants!$B$2*($G$8*$E26)*3630)*(1-$B26/100)","v":0},0,{"$f":"Constants!C40","v":25},0,0,{"$f":"IFERROR(($K26+$L26)*($G26+$H26*$J26/100)/$I26,0)","v":0},0,null,null,null,{"$f":"Constants!$D40","v":40},0,0,0,0]
[]
["3. Permeable Pavement  (RR)",null,null,null,null,null,null,null,null,null,null,null,null,null,null,null,null,"3. Permeable Pavement  (RR)"]
["3.a. Permeable Pavement #1 (P-FIL-03)",{"$f":"Constants!$B43","v":45},null,null,null,{"$f":"SUMIF($O$14:$O$103,P145,$H$14:$H$103)","v":0},{"$f":"(Constants!$B$2*($G$8*$E29)*3630)*$B29/100","v":0},{"$f":"(Constants!$B$2*($G$8*$E29)*3630)*(1-$B29/100)","v":0},{"$f":"+$G29+$H29","v":0},{"$f":"Constants!C43","v":25},{"$f":"SUMIF($O$13:$O$103,P145,$N$13:$N$103)","v":0},{"$f":"E29*$H$8","v":0},{"$f":"IFERROR(($K29+$L29)*($G29+$H29*$J29/100)/$I29,0)","v":0},{"$f":"$K29+$L29-$M29","v":0},null,null,null,{"$f":"Constants!$D43","v":25},{"$f":"SUMIF($O$14:$O$103,$P145,$V$14:$V$103)","v":0},{"$f":"E29*$R$8","v":0},{"$f":"IFERROR(($S29+$T29)*($G29+$H29*$R29/100)/$I29,0)","v":0},{"$f":"$S29+$T29-$U29","v":0}]
["3.b. Permeable Pavement #2 (P-FIL-03)",{"$f":"Constants!$B44","v":75},null,null,null,null,{"$f":"(Constants!$B$2*($G$8*$E30)*3630)*$B30/100","v":0},{"$f":"(Constants!$B$2*($G$8*$E30)*3630)*(1-$B30/100)","v":0},{"$f":"+$G30+$H30","v":0},{"$f":"Constants!C44","v":25},null,{"$f":"E30*$H$8","v":0},{"$f":"IFERROR(($K30+$L30)*($G30+$H30*$J30/100)/$I30,0)","v":0},{"$f":"$L30-$M30","v":0},null,null,null,{"$f":"Constants!$D44","v":25},null,{"$f":"E30*$R$8","v":0},{"$f":"IFERROR(($S30+$T30)*($G30+$H30*$R30/100)/$I30,0)","v":0},{"$f":"$S30+$T30-$U30","v":0}]
[]
["4. Grass Channel (RR)",null,null,null,null,null,null,null,null,null,null,null,null,null,null,null,null,"4. Grass Channel (RR)"]
["4.a. Grass Channel A/B Soils (P-CNV-01)",{"$f":"Constants!$B47","v":20},null,null,null,{"$f":"SUMIF($O$14:$O$103,P146,$H$14:$H$103)","v":0},{"$f":"(Constants!$B$2*($G$7*$D33+$G$8*$E33+$C33*$G$6)*3630+$F33)*$B33/100","v":0},{"$f":"(Constants!$B$2*($G$7*$D33+$G$8*$E33+$C33*$G$6)*3630+$F33)*(1-$B33/100)","v":0},{"$f":"+$G33+$H33","v":0},{"$f":"Constants!C47","v":15},{"$f":"SUMIF($O$13:$O$103,P146,$N$13:$N$103)","v":0},{"$f":"(D33*$H$7)+(C33*$H$6)+(E33*$H$8)","v":0},{"$f":"IFERROR(($K33+$L33)*($G33+$H33*$J33/100)/$I33,0)","v":0},{"$f":"$K33+$L33-$M33","v":0},null,null,null,{"$f":"Constants!$D47","v":20},{"$f":"SUMIF($O$14:$O$103,$P146,$V$14:$V$103)","v":0},{"$f":"(D33*$R$7)+(C33*$R$6)+(E33*$R$8)","v":0},{"$f":"IFERROR(($S33+$T33)*($G33+$H33*$R33/100)/$I33,0)","v":0},{"$f":"$S33+$T33-$U33","v":0}]
["4.b. Grass Channel C/D Soils (P-CNV-01)",{"$f":"Constants!$B48","v":10},null,null,null,{"$f":"SUMIF($O$14:$O$103,P147,$H$14:$H$103)","v":0},{"$f":"(Constants!$B$2*($G$7*$D34+$G$8*$E34+$C34*$G$6)*3630+$F34)*$B34/100","v":0},{"$f":"(Constants!$B$2*($G$7*$D34+$G$8*$E34+$C34*$G$6)*3630+$F34)*(1-$B34/100)","v":0},{"$f":"+$G34+$H34","v":0},{"$f":"Constants!C48","v":15},{"$f":"SUMIF($O$13:$O$103,P147,$N$13:$N$103)","v":0},{"$f":"(D34*$H$7)+(C34*$H$6)+(E34*$H$8)","v":0},{"$f":"IFERROR(($K34+$L34)*($G34+$H34*$J34/100)/$I34,0)","v":0},{"$f":"$K34+$L34-$M34","v":0},null,null,null,{"$f":"Constants!$D48","v":20},{"$f":"SUMIF($O$14:$O$103,$P147,$V$14:$V$103)","v":0},{"$f":"(D34*$R$7)+(C34*$R$6)+(E34*$R$8)","v":0},{"$f":"IFERROR(($S34+$T34)*($G34+$H34*$R34/100)/$I34,0)","v":0},{"$f":"$S34+$T34-$U34","v":0}]
["4.c. Grass Channel with Compost Amended Soils as per specs (P-FIL-08)",{"$f":"Constants!$B49","v":20},null,null,null,{"$f":"SUMIF($O$14:$O$103,P148,$H$14:$H$103)","v":0},{"$f":"(Constants!$B$2*($G$7*$D35+$G$8*$E35+$C35*$G$6)*3630+$F35)*$B35/100","v":0},{"$f":"(Constants!$B$2*($G$7*$D35+$G$8*$E35+$C35*$G$6)*3630+$F35)*(1-$B35/100)","v":0},{"$f":"+$G35+$H35","v":0},{"$f":"Constants!C49","v":15},{"$f":"SUMIF($O$13:$O$103,P148,$N$13:$N$103)","v":0},{"$f":"(D35*$H$7)+(C35*$H$6)+(E35*$H$8)","v":0},{"$f":"IFERROR(($K35+$L35)*($G35+$H35*$J35/100)/$I35,0)","v":0},{"$f":"$K35+$L35-$M35","v":0},null,null,null,{"$f":"Constants!$D49","v":20},{"$f":"SUMIF($O$14:$O$103,$P148,$V$14:$V$103)","v":0},{"$f":"(D35*$R$7)+(C35*$R$6)+(E35*$R$8)","v":0},{"$f":"IFERROR(($S35+$T35)*($G35+$H35*$R35/100)/$I35,0)","v":0},{"$f":"$S35+$T35-$U35","v":0}]
[null,null,null,null,null,null,null,null,null,null,null,null,null,null,null,null,null,null,null,null,null,null,null,"`"]
["5. Dry Swale (RR)",null,null,null,null,null,null,null,null,null,null,null,null,null,null,null,null,"5. Dry Swale (RR)"]
["5.a. Dry Swale #1 (P-CNV-02)",{"$f":"Constants!$B52","v":40},null,null,null,{"$f":"SUMIF($O$14:$O$103,P149,$H$14:$H$103)","v":0},{"$f":"(Constants!$B$2*($G$7*$D38+$G$8*$E38+$C38*$G$6)*3630+$F38)*$B38/100","v":0},{"$f":"(Constants!$B$2*($G$7*$D38+$G$8*$E38+$C38*$G$6)*3630+$F38)*(1-$B38/100)","v":0},{"$f":"+$G38+$H38","v":0},{"$f":"Constants!C52","v":20},{"$f":"SUMIF($O$13:$O$103,P149,$N$13:$N$103)","v":0},{"$f":"(D38*$H$7)+(C38*$H$6)+(E38*$H$8)","v":0},{"$f":"IFERROR(($K38+$L38)*($G38+$H38*$J38/100)/$I38,0)","v":0},{"$f":"$K38+$L38-$M38","v":0},null,null,null,{"$f":"Constants!$D52","v":25},{"$f":"SUMIF($O$14:$O$103,$P149,$V$14:$V$103)","v":0},{"$f":"(D38*$R$7)+(C38*$R$6)+(E38*$R$8)","v":0},{"$f":"IFERROR(($S38+$T38)*($G38+$H38*$R38/100)/$I38,0)","v":0},{"$f":"$S38+$T38-$U38","v":0}]
["5.b. Dry Swale #2 (P-CNV-02)",{"$f":"Constants!$B53","v":60},null,null,null,{"$f":"SUMIF($O$14:$O$103,P150,$H$14:$H$103)","v":0},{"$f":"(Constants!$B$2*($G$7*$D39+$G$8*$E39+$C39*$G$6)*3630+$F39)*$B39/100","v":0},{"$f":"(Constants!$B$2*($G$7*$D39+$G$8*$E39+$C39*$G$6)*3630+$F39)*(1-$B39/100)","v":0},{"$f":"+$G39+$H39","v":0},{"$f":"Constants!C53","v":40},{"$f":"SUMIF($O$13:$O$103,P150,$N$13:$N$103)","v":0},{"$f":"(D39*$H$7)+(C39*$H$6)+(E39*$H$8)","v":0},{"$f":"IFERROR(($K39+$L39)*($G39+$H39*$J39/100)/$I39,0)","v":0},{"$f":"$K39+$L39-$M39","v":0},null,null,null,{"$f":"Constants!$D53","v":35},{"$f":"SUMIF($O$14:$O$103,$P150,$V$14:$V$103)","v":0},{"$f":"(D39*$R$7)+(C39*$R$6)+(E39*$R$8)","v":0},{"$f":"IFERROR(($S39+$T39)*($G39+$H39*$R39/100)/$I39,0)","v":0},{"$f":"$S39+$T39-$U39","v":0}]
[]
["6. Bioretention (RR)",null,null,null,null,null,null,null,null,null,null,null,null,null,null,null,null,"6. Bioretention (RR)"]
["6.a. Bioretention #1 or Micro-Bioretention #1 or Urban Bioretention (P-FIL-05)",{"$f":"Constants!$B56","v":40},null,null,null,{"$f":"SUMIF($O$14:$O$103,P151,$H$14:$H$103)","v":0},{"$f":"(Constants!$B$2*($G$7*$D42+$G$8*$E42+$C42*$G$6)*3630+$F42)*$B42/100","v":0},{"$f":"(Constants!$B$2*($G$7*$D42+$G$8*$E42+$C42*$G$6)*3630+$F42)*(1-$B42/100)","v":0},{"$f":"+$G42+$H42","v":0},{"$f":"Constants!C56","v":25},{"$f":"SUMIF($O$13:$O$103,P151,$N$13:$N$103)","v":0},{"$f":"(D42*$H$7)+(C42*$H$6)+(E42*$H$8)","v":0},{"$f":"IFERROR(($K42+$L42)*($G42+$H42*$J42/100)/$I42,0)","v":0},{"$f":"$K42+$L42-$M42","v":0},null,null,null,{"$f":"Constants!$D56","v":40},{"$f":"SUMIF($O$14:$O$103,$P151,$V$14:$V$103)","v":0},{"$f":"(D42*$R$7)+(C42*$R$6)+(E42*$R$8)","v":0},{"$f":"IFERROR(($S42+$T42)*($G42+$H42*$R42/100)/$I42,0)","v":0},{"$f":"$S42+$T42-$U42","v":0}]
["6.b. Bioretention #2 or \nMicro-Bioretention #2 (P-FIL-05)",{"$f":"Constants!$B57","v":80},null,null,null,{"$f":"SUMIF($O$14:$O$103,P152,$H$14:$H$103)","v":0},{"$f":"(Constants!$B$2*($G$7*$D43+$G$8*$E43+$C43*$G$6)*3630+$F43)*$B43/100","v":0},{"$f":"(Constants!$B$2*($G$7*$D43+$G$8*$E43+$C43*$G$6)*3630+$F43)*(1-$B43/100)","v":0},{"$f":"+$G43+$H43","v":0},{"$f":"Constants!C57","v":50},{"$f":"SUMIF($O$13:$O$103,P152,$N$13:$N$103)","v":0},{"$f":"(D43*$H$7)+(C43*$H$6)+(E43*$H$8)","v":0},{"$f":"IFERROR(($K43+$L43)*($G43+$H43*$J43/100)/$I43,0)","v":0},{"$f":"$K43+$L43-$M43","v":0},null,null,null,{"$f":"Constants!$D57","v":60},{"$f":"SUMIF($O$14:$O$103,$P152,$V$14:$V$103)","v":0},{"$f":"(D43*$R$7)+(C43*$R$6)+(E43*$R$8)","v":0},{"$f":"IFERROR(($S43+$T43)*($G43+$H43*$R43/100)/$I43,0)","v":0},{"$f":"$S43+$T43-$U43","v":0}]
[]
["7. Infiltration (RR)",null,null,null,null,null,null,null,null,null,null,null,null,null,null,null,null,"7. Infiltration (RR)"]
["7.a. Infiltration #1 (P-FIL-04)",{"$f":"Constants!$B60","v":50},null,null,null,{"$f":"SUMIF($O$14:$O$103,P153,$H$14:$H$103)","v":0},{"$f":"(Constants!$B$2*($G$7*$D46+$G$8*$E46+$C46*$G$6)*3630+$F46)*$B46/100","v":0},{"$f":"(Constants!$B$2*($G$7*$D46+$G$8*$E46+$C46*$G$6)*3630+$F46)*(1-$B46/100)","v":0},{"$f":"+$G46+$H46","v":0},{"$f":"Constants!C60","v":25},{"$f":"SUMIF($O$13:$O$103,P153,$N$13:$N$103)","v":0},{"$f":"(D46*$H$7)+(C46*$H$6)+(E46*$H$8)","v":0},{"$f":"IFERROR(($K46+$L46)*($G46+$H46*$J46/100)/$I46,0)","v":0},{"$f":"$K46+$L46-$M46","v":0},null,null,null,{"$f":"Constants!$D60","v":15},{"$f":"SUMIF($O$14:$O$103,$P153,$V$14:$V$103)","v":0},{"$f":"(D46*$R$7)+(C46*$R$6)+(E46*$R$8)","v":0},{"$f":"IFERROR(($S46+$T46)*($G46+$H46*$R46/100)/$I46,0)","v":0},{"$f":"$S46+$T46-$U46","v":0}]
["7.b. Infiltration #2 (P-FIL-04)",{"$f":"Constants!$B61","v":90},null,null,null,{"$f":"SUMIF($O$14:$O$103,P154,$H$14:$H$103)","v":0},{"$f":"(Constants!$B$2*($G$7*$D47+$G$8*$E47+$C47*$G$6)*3630+$F47)*$B47/100","v":0},{"$f":"(Constants!$B$2*($G$7*$D47+$G$8*$E47+$C47*$G$6)*3630+$F47)*(1-$B47/100)","v":0},{"$f":"+$G47+$H47","v":0},{"$f":"Constants!C61","v":25},{"$f":"SUMIF($O$13:$O$103,P154,$N$13:$N$103)","v":0},{"$f":"(D47*$H$7)+(C47*$H$6)+(E47*$H$8)","v":0},{"$f":"IFERROR(($K47+$L47)*($G47+$H47*$J47/100)/$I47,0)","v":0},{"$f":"$K47+$L47-$M47","v":0},null,null,null,{"$f":"Constants!$D61","v":15},{"$f":"SUMIF($O$14:$O$103,$P154,$V$14:$V$103)","v":0},{"$f":"(D47*$R$7)+(C47*$R$6)+(E47*$R$8)","v":0},{"$f":"IFERROR(($S47+$T47)*($G47+$H47*$R47/100)/$I47,0)","v":0},{"$f":"$S47+$T47-$U47","v":0}]
[]
["8. Extended Detention Pond (RR)",null,null,null,null,null,null,null,null,null,null,null,null,null,null,null,null,"8. Extended Detention Pond (RR)"]
["8.a. ED #1 (P-BAS-03)",{"$f":"Constants!$B64","v":0},null,null,null,{"$f":"SUMIF($O$14:$O$103,P155,$H$14:$H$103)","v":0},{"$f":"(Constants!$B$2*($G$7*$D50+$G$8*$E50+$C50*$G$6)*3630+$F50)*$B50/100","v":0},{"$f":"(Constants!$B$2*($G$7*$D50+$G$8*$E50+$C50*$G$6)*3630+$F50)*(1-$B50/100)","v":0},{"$f":"+$G50+$H50","v":0},{"$f":"Constants!C64","v":15},{"$f":"SUMIF($O$13:$O$103,P155,$N$13:$N$103)","v":0},{"$f":"(D50*$H$7)+(C50*$H$6)+(E50*$H$8)","v":0},{"$f":"IFERROR(($K50+$L50)*($G50+$H50*$J50/100)/$I50,0)","v":0},{"$f":"$K50+$L50-$M50","v":0},null,null,null,{"$f":"Constants!$D64","v":10},{"$f":"SUMIF($O$14:$O$103,$P155,$V$14:$V$103)","v":0},{"$f":"(D50*$R$7)+(C50*$R$6)+(E50*$R$8)","v":0},{"$f":"IFERROR(($S50+$T50)*($G50+$H50*$R50/100)/$I50,0)","v":0},{"$f":"$S50+$T50-$U50","v":0}]
["8.b. ED #2 (P-BAS-03)",{"$f":"Constants!$B65","v":15},null,null,null,{"$f":"SUMIF($O$14:$O$103,P156,$H$14:$H$103)","v":0},{"$f":"(Constants!$B$2*($G$7*$D51+$G$8*$E51+$C51*$G$6)*3630+$F51)*$B51/100","v":0},{"$f":"(Constants!$B$2*($G$7*$D51+$G$8*$E51+$C51*$G$6)*3630+$F51)*(1-$B51/100)","v":0},{"$f":"+$G51+$H51","v":0},{"$f":"Constants!C65","v":15},{"$f":"SUMIF($O$13:$O$103,P156,$N$13:$N$103)","v":0},{"$f":"(D51*$H$7)+(C51*$H$6)+(E51*$H$8)","v":0},{"$f":"IFERROR(($K51+$L51)*($G51+$H51*$J51/100)/$I51,0)","v":0},{"$f":"$K51+$L51-$M51","v":0},null,null,null,{"$f":"Constants!$D65","v":10},{"$f":"SUMIF($O$14:$O$103,$P156,$V$14:$V$103)","v":0},{"$f":"(D51*$R$7)+(C51*$R$6)+(E51*$R$8)","v":0},{"$f":"IFERROR(($S51+$T51)*($G51+$H51*$R51/100)/$I51,0)","v":0},{"$f":"$S51+$T51-$U51","v":0}]
[]
["9. Sheetflow to Filter/Open Space (RR)",null,null,null,null,null,null,null,null,null,null,null,null,null,null,null,null,"9. Sheetflow to Filter/Open Space (RR)"]
["9.a. Sheetflow to Conservation Area, A/B Soils (P-FIL-07)",{"$f":"Constants!$B68","v":75},null,null,null,{"$f":"SUMIF($O$14:$O$103,P157,$H$14:$H$103)","v":0},{"$f":"(Constants!$B$2*($G$7*$D54+$G$8*$E54+$C54*$G$6)*3630+$F54)*$B54/100","v":0},{"$f":"(Constants!$B$2*($G$7*$D54+$G$8*$E54+$C54*$G$6)*3630+$F54)*(1-$B54/100)","v":0},{"$f":"+$G54+$H54","v":0},{"$f":"Constants!C68","v":0},{"$f":"SUMIF($O$13:$O$103,P157,$N$13:$N$103)","v":0},{"$f":"(D54*$H$7)+(C54*$H$6)+(E54*$H$8)","v":0},{"$f":"IFERROR(($K54+$L54)*($G54+$H54*$J54/100)/$I54,0)","v":0},{"$f":"$K54+$L54-$M54","v":0},null,null,null,{"$f":"Constants!$D68","v":0},{"$f":"SUMIF($O$14:$O$103,$P157,$V$14:$V$103)","v":0},{"$f":"(D54*$R$7)+(C54*$R$6)+(E54*$R$8)","v":0},{"$f":"IFERROR(($S54+$T54)*($G54+$H54*$R54/100)/$I54,0)","v":0},{"$f":"$S54+$T54-$U54","v":0}]
["9.b. Sheetflow to Conservation Area, C/D Soils (P-FIL-07)",{"$f":"Constants!$B69","v":50},null,null,null,{"$f":"SUMIF($O$14:$O$103,P158,$H$14:$H$103)","v":0},{"$f":"(Constants!$B$2*($G$7*$D55+$G$8*$E55+$C55*$G$6)*3630+$F55)*$B55/100","v":0},{"$f":"(Constants!$B$2*($G$7*$D55+$G$8*$E55+$C55*$G$6)*3630+$F55)*(1-$B55/100)","v":0},{"$f":"+$G55+$H55","v":0},{"$f":"Constants!C69","v":0},{"$f":"SUMIF($O$13:$O$103,P158,$N$13:$N$103)","v":0},{"$f":"(D55*$H$7)+(C55*$H$6)+(E55*$H$8)","v":0},{"$f":"IFERROR(($K55+$L55)*($G55+$H55*$J55/100)/$I55,0)","v":0},{"$f":"$K55+$L55-$M55","v":0},null,null,null,{"$f":"Constants!$D69","v":0},{"$f":"SUMIF($O$14:$O$103,$P158,$V$14:$V$103)","v":0},{"$f":"(D55*$R$7)+(C55*$R$6)+(E55*$R$8)","v":0},{"$f":"IFERROR(($S55+$T55)*($G55+$H55*$R55/100)/$I55,0)","v":0},{"$f":"$S55+$T55-$U55","v":0}]
["9.c. Sheetflow to Vegetated Filter Strip, A Soils or Compost Amended B/C/D Soils \n(Spec P-FIL-07 & P-FIL-08)",{"$f":"Constants!$B70","v":50},null,null,null,{"$f":"SUMIF($O$14:$O$103,P159,$H$14:$H$103)","v":0},{"$f":"(Constants!$B$2*($G$7*$D56+$G$8*$E56+$C56*$G$6)*3630+$F56)*$B56/100","v":0},{"$f":"(Constants!$B$2*($G$7*$D56+$G$8*$E56+$C56*$G$6)*3630+$F56)*(1-$B56/100)","v":0},{"$f":"+$G56+$H56","v":0},{"$f":"Constants!C70","v":0},{"$f":"SUMIF($O$13:$O$103,P159,$N$13:$N$103)","v":0},{"$f":"(D56*$H$7)+(C56*$H$6)+(E56*$H$8)","v":0},{"$f":"IFERROR(($K56+$L56)*($G56+$H56*$J56/100)/$I56,0)","v":0},{"$f":"$K56+$L56-$M56","v":0},null,null,null,{"$f":"Constants!$D70","v":0},{"$f":"SUMIF($O$14:$O$103,$P159,$V$14:$V$103)","v":0},{"$f":"(D56*$R$7)+(C56*$R$6)+(E56*$R$8)","v":0},{"$f":"IFERROR(($S56+$T56)*($G56+$H56*$R56/100)/$I56,0)","v":0},{"$f":"$S56+$T56-$U56","v":0}]
[]
["10. Regenerative Stormwater Conveyance",null,null,null,null,null,null,null,null,null,null,null,null,null,null,null,null,"10. Regenerative Stormwater Conveyance"]
["10.a. Regenerative Stormwater Conveyance (P-CNV-04)",{"$f":"Constants!$B73","v":0},null,null,null,{"$f":"SUMIF($O$14:$O$103,P160,$H$14:$H$103)","v":0},{"$f":"(Constants!$B$2*($G$7*$D59+$G$8*$E59+$C59*$G$6)*3630+$F59)*$B59/100","v":0},{"$f":"(Constants!$B$2*($G$7*$D59+$G$8*$E59+$C59*$G$6)*3630+$F59)*(1-$B59/100)","v":0},{"$f":"+$G59+$H59","v":0},{"$f":"Constants!C73","v":20},{"$f":"SUMIF($O$13:$O$103,P160,$N$13:$N$103)","v":0},{"$f":"(D59*$H$7)+(C59*$H$6)+(E59*$H$8)","v":0},{"$f":"IFERROR(($K59+$L59)*($G59+$H59*$J59/100)/$I59,0)","v":0},{"$f":"$K59+$L59-$M59","v":0},null,null,null,{"$f":"Constants!$D73","v":25},{"$f":"SUMIF($O$14:$O$103,$P160,$V$14:$V$103)","v":0},{"$f":"(D59*$R$7)+(C59*$R$6)+(E59*$R$8)","v":0},{"$f":"IFERROR(($S59+$T59)*($G59+$H59*$R59/100)/$I59,0)","v":0},{"$f":"$S59+$T59-$U59","v":0}]
["10.b. Regenerative Stormwater Conveyance (P-CNV-04)",{"$f":"Constants!$B74","v":0},null,null,null,{"$f":"SUMIF($O$14:$O$103,P161,$H$14:$H$103)","v":0},{"$f":"(Constants!$B$2*($G$7*$D60+$G$8*$E60+$C60*$G$6)*3630+$F60)*$B60/100","v":0},{"$f":"(Constants!$B$2*($G$7*$D60+$G$8*$E60+$C60*$G$6)*3630+$F60)*(1-$B60/100)","v":0},{"$f":"+$G60+$H60","v":0},{"$f":"Constants!C74","v":40},{"$f":"SUMIF($O$13:$O$103,P161,$N$13:$N$103)","v":0},0,0,{"$f":"$K60+$L60-$M60","v":0},null,null,null,{"$f":"Constants!$D74","v":35},{"$f":"SUMIF($O$14:$O$103,$P161,$V$14:$V$103)","v":0},{"$f":"(D60*$R$7)+(C60*$R$6)+(E60*$R$8)","v":0},{"$f":"IFERROR(($S60+$T60)*($G60+$H60*$R60/100)/$I60,0)","v":0},{"$f":"$S60+$T60-$U60","v":0}]
[]
["11. Tree BMP",null,null,null,null,null,null,null,null,null,null,null,null,null,null,null,null,"11. Tree BMP"]
["11.a. Trees over Pervious, A/B (P-FIL-09)",{"$f":"Constants!$B77","v":16},null,null,null,{"$f":"SUMIF($O$14:$O$103,P162,$H$14:$H$103)","v":0},{"$f":"(Constants!$B$2*($G$7*$D63+$G$8*$E63+$C63*$G$6)*3630+$F63)*$B63/100","v":0},{"$f":"(Constants!$B$2*($G$7*$D63+$G$8*$E63+$C63*$G$6)*3630+$F63)*(1-$B63/100)","v":0},{"$f":"+$G63+$H63","v":0},{"$f":"Constants!C77","v":0},{"$f":"SUMIF($O$13:$O$103,P162,$N$13:$N$103)","v":0},{"$f":"(D63*$H$7)+(C63*$H$6)+(E63*$H$8)","v":0},{"$f":"IFERROR(($K63+$L63)*($G63+$H63*$J63/100)/$I63,0)","v":0},{"$f":"$K63+$L63-$M63","v":0},null,null,null,{"$f":"Constants!$D77","v":0},{"$f":"SUMIF($O$14:$O$103,$P162,$V$14:$V$103)","v":0},{"$f":"(D63*$R$7)+(C63*$R$6)+(E63*$R$8)","v":0},{"$f":"IFERROR(($S63+$T63)*($G63+$H63*$R63/100)/$I63,0)","v":0},{"$f":"$S63+$T63-$U63","v":0}]
["11.b. Trees over Pervious, C/D (P-FIL-09)",{"$f":"Constants!$B78","v":12},null,null,null,{"$f":"SUMIF($O$14:$O$103,P163,$H$14:$H$103)","v":0},{"$f":"(Constants!$B$2*($G$7*$D64+$G$8*$E64+$C64*$G$6)*3630+$F64)*$B64/100","v":0},{"$f":"(Constants!$B$2*($G$7*$D64+$G$8*$E64+$C64*$G$6)*3630+$F64)*(1-$B64/100)","v":0},{"$f":"+$G64+$H64","v":0},{"$f":"Constants!C78","v":0},{"$f":"SUMIF($O$13:$O$103,P163,$N$13:$N$103)","v":0},0,{"$f":"IFERROR(($K64+$L64)*($G64+$H64*$J64/100)/$I64,0)","v":0},{"$f":"$K64+$L64-$M64","v":0},null,null,null,{"$f":"Constants!$D78","v":0},{"$f":"SUMIF($O$14:$O$103,$P163,$V$14:$V$103)","v":0},{"$f":"(D64*$R$7)+(C64*$R$6)+(E64*$R$8)","v":0},{"$f":"IFERROR(($S64+$T64)*($G64+$H64*$R64/100)/$I64,0)","v":0},{"$f":"$S64+$T64-$U64","v":0}]
["11.c. Trees over Impervious (P-FIL-09)",{"$f":"Constants!$B79","v":3.5},null,null,null,{"$f":"SUMIF($O$14:$O$103,P164,$H$14:$H$103)","v":0},{"$f":"(Constants!$B$2*($G$7*$D65+$G$8*$E65+$C65*$G$6)*3630+$F65)*$B65/100","v":0},{"$f":"(Constants!$B$2*($G$7*$D65+$G$8*$E65+$C65*$G$6)*3630+$F65)*(1-$B65/100)","v":0},{"$f":"+$G65+$H65","v":0},{"$f":"Constants!C79","v":0},{"$f":"SUMIF($O$13:$O$103,P164,$N$13:$N$103)","v":0},{"$f":"(D65*$H$7)+(C65*$H$6)+(E65*$H$8)","v":0},{"$f":"IFERROR(($K65+$L65)*($G65+$H65*$J65/100)/$I65,0)","v":0},{"$f":"$K65+$L65-$M65","v":0},null,null,null,{"$f":"Constants!$D79","v":0},{"$f":"SUMIF($O$14:$O$103,$P164,$V$14:$V$103)","v":0},{"$f":"(D65*$R$7)+(C65*$R$6)+(E65*$R$8)","v":0},{"$f":"IFERROR(($S65+$T65)*($G65+$H65*$R65/100)/$I65,0)","v":0},{"$f":"$S65+$T65-$U65","v":0}]
[]
[]
[null,null,null,null,"TOTAL IMPERVIOUS COVER TREATED (ac)",{"$f":"SUM(E14:E65)","v":0},"AREA CHECK:",{"$f":"IF(F68>$F$8,\"AREA EXCEEDED!\",\"OK.\")","v":"OK."}]
[null,null,null,null,"TOTAL MIXED OPEN TREATED (ac)",{"$f":"SUM(C14:C65)","v":0},"AREA CHECK:",{"$f":"IF(F69>$F$6,\"AREA EXCEEDED!\",\"OK.\")","v":"OK."}]
[null,null,null,null,"TOTAL MANAGED TURF AREA TREATED (ac)",{"$f":"SUM(D33:D65)","v":0},"AREA CHECK:",{"$f":"IF(F70>$F$7,\"AREA EXCEEDED!\",\"OK.\")","v":"OK."}]
[null,null,null,null,"TOTAL RUNOFF REDUCTION IN D.A. D (ft3)",{"$f":"IFERROR(SUM($G$14:$G$65),0)","v":0}]
[]
[null,null,null,null,null,null,null,"TOTAL PHOSPHORUS AVAILABLE FOR REMOVAL IN D.A. D (lb/yr)",{"$f":"$N$8","v":0},null,null,null,null,null,null,null,null,null,null,null,null,"TOTAL RUNOFF REDUCTION IN D.A. D (ft3)",{"$f":"F71","v":0}]
[null,null,null,null,null,null,null,"TOTAL PHOSPHORUS REMOVED WITH RUNOFF REDUCTION PRACTICES IN D.A. D (lb/yr)",{"$f":"IFERROR(SUM(M14:M65),0)","v":0},null,null,null,null,null,null,null,null,null,null,null,null,"NITROGEN REMOVED WITH RUNOFF REDUCTION PRACTICES IN D.A. D (lb/yr)",{"$f":"SUM($U$14:$U$65)","v":0}]
[null,null,null,null,null,null,null,"TOTAL PHOSPHORUS REMAINING AFTER APPLYING RUNOFF REDUCTION PRACTICES IN D.A. D (lb/yr)",{"$f":"I73-I74","v":0}]
[null,null,null,null,null,null,null,null,null,null,null,null,null,null,null,null,null,null,null,null,null,null,"           SEE WATER QUALITY COMPLIANCE TAB FOR SITE CALCULATIONS (Information Only)"]
[null,null,"SEE WATER QUALITY COMPLIANCE TAB FOR SITE COMPLIANCE CALCULATIONS"]
[]
[]
[]
[]
["12. Wet Swale (no RR)",null,null,null,null,null,null,null,null,null,null,null,null,null,null,null,null,"12. Wet Swale (Coastal Plain) (no RR)"]
["12.a. Wet Swale #1 (P-CNV-03)",{"$f":"Constants!$B82","v":0},null,null,null,{"$f":"SUMIF($O$14:$O$103,P165,$H$14:$H$103)","v":0},{"$f":"(Constants!$B$2*($G$7*$D83+$G$8*$E83+$C83*$G$6)*3630+$F83)*$B83/100","v":0},{"$f":"(Constants!$B$2*($G$7*$D83+$G$8*$E83+$C83*$G$6)*3630+$F83)*(1-$B83/100)","v":0},{"$f":"+$G83+$H83","v":0},{"$f":"Constants!C82","v":20},{"$f":"SUMIF($O$13:$O$103,P165,$N$13:$N$103)","v":0},{"$f":"(D83*$H$7)+(C83*$H$6)+(E83*$H$8)","v":0},{"$f":"IFERROR(($K83+$L83)*($G83+$H83*$J83/100)/$I83,0)","v":0},{"$f":"$K83+$L83-$M83","v":0},null,null,null,{"$f":"Constants!$D82","v":25},{"$f":"SUMIF($O$14:$O$103,$P165,$V$14:$V$103)","v":0},{"$f":"(D83*$R$7)+(C83*$R$6)+(E83*$R$8)","v":0},{"$f":"IFERROR(($S83+$T83)*($G83+$H83*$R83/100)/$I83,0)","v":0},{"$f":"$S83+$T83-$U83","v":0}]
["12.b. Wet Swale #2 (P-CNV-03)",{"$f":"Constants!$B83","v":0},null,null,null,{"$f":"SUMIF($O$14:$O$103,P166,$H$14:$H$103)","v":0},{"$f":"(Constants!$B$2*($G$7*$D84+$G$8*$E84+$C84*$G$6)*3630+$F84)*$B84/100","v":0},{"$f":"(Constants!$B$2*($G$7*$D84+$G$8*$E84+$C84*$G$6)*3630+$F84)*(1-$B84/100)","v":0},{"$f":"+$G84+$H84","v":0},{"$f":"Constants!C83","v":40},{"$f":"SUMIF($O$13:$O$103,P166,$N$13:$N$103)","v":0},{"$f":"(D84*$H$7)+(C84*$H$6)+(E84*$H$8)","v":0},{"$f":"IFERROR(($K84+$L84)*($G84+$H84*$J84/100)/$I84,0)","v":0},{"$f":"$K84+$L84-$M84","v":0},null,null,null,{"$f":"Constants!$D83","v":35},{"$f":"SUMIF($O$14:$O$103,$P166,$V$14:$V$103)","v":0},{"$f":"(D84*$R$7)+(C84*$R$6)+(E84*$R$8)","v":0},{"$f":"IFERROR(($S84+$T84)*($G84+$H84*$R84/100)/$I84,0)","v":0},{"$f":"$S84+$T84-$U84","v":0}]
[]
["13.  Filtering Practices (no RR)",null,null,null,null,null,null,null,null,null,null,null,null,null,null,null,null,"13.  Filtering Practices (no RR)"]
["13.a.Filtering Practice #1 (P-FIL-06)",{"$f":"Constants!$B86","v":0},null,null,null,{"$f":"SUMIF($O$14:$O$103,P167,$H$14:$H$103)","v":0},{"$f":"(Constants!$B$2*($G$7*$D87+$G$8*$E87+$C87*$G$6)*3630+$F87)*$B87/100","v":0},{"$f":"(Constants!$B$2*($G$7*$D87+$G$8*$E87+$C87*$G$6)*3630+$F87)*(1-$B87/100)","v":0},{"$f":"+$G87+$H87","v":0},{"$f":"Constants!C86","v":60},{"$f":"SUMIF($O$13:$O$103,P167,$N$13:$N$103)","v":0},{"$f":"(D87*$H$7)+(C87*$H$6)+(E87*$H$8)","v":0},{"$f":"IFERROR(($K87+$L87)*($G87+$H87*$J87/100)/$I87,0)","v":0},{"$f":"$K87+$L87-$M87","v":0},null,null,null,{"$f":"Constants!$D86","v":30},{"$f":"SUMIF($O$14:$O$103,$P167,$V$14:$V$103)","v":0},{"$f":"(D87*$R$7)+(C87*$R$6)+(E87*$R$8)","v":0},{"$f":"IFERROR(($S87+$T87)*($G87+$H87*$R87/100)/$I87,0)","v":0},{"$f":"$S87+$T87-$U87","v":0}]
["13.b. Filtering Practice #2 (P-FIL-06)",{"$f":"Constants!$B87","v":0},null,null,null,{"$f":"SUMIF($O$14:$O$103,P168,$H$14:$H$103)","v":0},{"$f":"(Constants!$B$2*($G$7*$D88+$G$8*$E88+$C88*$G$6)*3630+$F88)*$B88/100","v":0},{"$f":"(Constants!$B$2*($G$7*$D88+$G$8*$E88+$C88*$G$6)*3630+$F88)*(1-$B88/100)","v":0},{"$f":"+$G88+$H88","v":0},{"$f":"Constants!C87","v":65},{"$f":"SUMIF($O$13:$O$103,P168,$N$13:$N$103)","v":0},{"$f":"(D88*$H$7)+(C88*$H$6)+(E88*$H$8)","v":0},{"$f":"IFERROR(($K88+$L88)*($G88+$H88*$J88/100)/$I88,0)","v":0},{"$f":"$K88+$L88-$M88","v":0},null,null,null,{"$f":"Constants!$D87","v":45},{"$f":"SUMIF($O$14:$O$103,$P168,$V$14:$V$103)","v":0},{"$f":"(D88*$R$7)+(C88*$R$6)+(E88*$R$8)","v":0},{"$f":"IFERROR(($S88+$T88)*($G88+$H88*$R88/100)/$I88,0)","v":0},{"$f":"$S88+$T88-$U88","v":0}]
[]
["14. Constructed Wetland (no RR)",null,null,null,null,null,null,null,null,null,null,null,null,null,null,null,null,"14. Constructed Wetland (no RR)"]
["14.a.Constructed Wetland #1 (P-BAS-01)",{"$f":"Constants!$B90","v":0},null,null,null,{"$f":"SUMIF($O$14:$O$103,P169,$H$14:$H$103)","v":0},{"$f":"(Constants!$B$2*($G$7*$D91+$G$8*$E91+$C91*$G$6)*3630+$F91)*$B91/100","v":0},{"$f":"(Constants!$B$2*($G$7*$D91+$G$8*$E91+$C91*$G$6)*3630+$F91)*(1-$B91/100)","v":0},{"$f":"+$G91+$H91","v":0},{"$f":"Constants!C90","v":50},{"$f":"SUMIF($O$13:$O$103,P169,$N$13:$N$103)","v":0},{"$f":"(D91*$H$7)+(C91*$H$6)+(E91*$H$8)","v":0},{"$f":"IFERROR(($K91+$L91)*($G91+$H91*$J91/100)/$I91,0)","v":0},{"$f":"$K91+$L91-$M91","v":0},null,null,null,{"$f":"Constants!$D90","v":25},{"$f":"SUMIF($O$14:$O$103,$P169,$V$14:$V$103)","v":0},{"$f":"(D91*$R$7)+(C91*$R$6)+(E91*$R$8)","v":0},{"$f":"IFERROR(($S91+$T91)*($G91+$H91*$R91/100)/$I91,0)","v":0},{"$f":"$S91+$T91-$U91","v":0}]
["14.b. Constructed Wetland #2 (P-BAS-01)",{"$f":"Constants!$B91","v":0},null,null,null,{"$f":"SUMIF($O$14:$O$103,P170,$H$14:$H$103)","v":0},{"$f":"(Constants!$B$2*($G$7*$D92+$G$8*$E92+$C92*$G$6)*3630+$F92)*$B92/100","v":0},{"$f":"(Constants!$B$2*($G$7*$D92+$G$8*$E92+$C92*$G$6)*3630+$F92)*(1-$B92/100)","v":0},{"$f":"+$G92+$H92","v":0},{"$f":"Constants!C91","v":75},{"$f":"SUMIF($O$13:$O$103,P170,$N$13:$N$103)","v":0},{"$f":"(D92*$H$7)+(C92*$H$6)+(E92*$H$8)","v":0},{"$f":"IFERROR(($K92+$L92)*($G92+$H92*$J92/100)/$I92,0)","v":0},{"$f":"$K92+$L92-$M92","v":0},null,null,null,{"$f":"Constants!$D91","v":55},{"$f":"SUMIF($O$14:$O$103,$P170,$V$14:$V$103)","v":0},{"$f":"(D92*$R$7)+(C92*$R$6)+(E92*$R$8)","v":0},{"$f":"IFERROR(($S92+$T92)*($G92+$H92*$R92/100)/$I92,0)","v":0},{"$f":"$S92+$T92-$U92","v":0}]
[]
["15. Wet Ponds (no RR)",null,null,null,null,null,null,null,null,null,null,null,null,null,null,null,null,"15. Wet Ponds (no RR)"]
["15.a. Wet Pond #1 (P-BAS-02)",{"$f":"Constants!$B94","v":0},null,null,null,{"$f":"SUMIF($O$14:$O$103,P171,$H$14:$H$103)","v":0},{"$f":"(Constants!$B$2*($G$7*$D95+$G$8*$E95+$C95*$G$6)*3630+$F95)*$B95/100","v":0},{"$f":"(Constants!$B$2*($G$7*$D95+$G$8*$E95+$C95*$G$6)*3630+$F95)*(1-$B95/100)","v":0},{"$f":"+$G95+$H95","v":0},{"$f":"Constants!C94","v":50},{"$f":"SUMIF($O$13:$O$103,P171,$N$13:$N$103)","v":0},{"$f":"(D95*$H$7)+(C95*$H$6)+(E95*$H$8)","v":0},{"$f":"IFERROR(($K95+$L95)*($G95+$H95*$J95/100)/$I95,0)","v":0},{"$f":"$K95+$L95-$M95","v":0},null,null,null,{"$f":"Constants!$D94","v":30},{"$f":"SUMIF($O$14:$O$103,$P171,$V$14:$V$103)","v":0},{"$f":"(D95*$R$7)+(C95*$R$6)+(E95*$R$8)","v":0},{"$f":"IFERROR(($S95+$T95)*($G95+$H95*$R95/100)/$I95,0)","v":0},{"$f":"$S95+$T95-$U95","v":0}]
["15.b. Wet Pond #1 (Coastal Plain) (P-BAS-02)",{"$f":"Constants!$B95","v":0},null,null,null,{"$f":"SUMIF($O$14:$O$103,P172,$H$14:$H$103)","v":0},{"$f":"(Constants!$B$2*($G$7*$D96+$G$8*$E96+$C96*$G$6)*3630+$F96)*$B96/100","v":0},{"$f":"(Constants!$B$2*($G$7*$D96+$G$8*$E96+$C96*$G$6)*3630+$F96)*(1-$B96/100)","v":0},{"$f":"+$G96+$H96","v":0},{"$f":"Constants!C95","v":45},{"$f":"SUMIF($O$13:$O$103,P172,$N$13:$N$103)","v":0},{"$f":"(D96*$H$7)+(C96*$H$6)+(E96*$H$8)","v":0},{"$f":"IFERROR(($K96+$L96)*($G96+$H96*$J96/100)/$I96,0)","v":0},{"$f":"$K96+$L96-$M96","v":0},null,null,null,{"$f":"Constants!$D95","v":20},{"$f":"SUMIF($O$14:$O$103,$P172,$V$14:$V$103)","v":0},{"$f":"(D96*$R$7)+(C96*$R$6)+(E96*$R$8)","v":0},{"$f":"IFERROR(($S96+$T96)*($G96+$H96*$R96/100)/$I96,0)","v":0},{"$f":"$S96+$T96-$U96","v":0}]
["15.c. Wet Pond #2 (P-BAS-02)",{"$f":"Constants!$B96","v":0},null,null,null,{"$f":"SUMIF($O$14:$O$103,P173,$H$14:$H$103)","v":0},{"$f":"(Constants!$B$2*($G$7*$D97+$G$8*$E97+$C97*$G$6)*3630+$F97)*$B97/100","v":0},{"$f":"(Constants!$B$2*($G$7*$D97+$G$8*$E97+$C97*$G$6)*3630+$F97)*(1-$B97/100)","v":0},{"$f":"+$G97+$H97","v":0},{"$f":"Constants!C96","v":75},{"$f":"SUMIF($O$13:$O$103,P173,$N$13:$N$103)","v":0},{"$f":"(D97*$H$7)+(C97*$H$6)+(E97*$H$8)","v":0},{"$f":"IFERROR(($K97+$L97)*($G97+$H97*$J97/100)/$I97,0)","v":0},{"$f":"$K97+$L97-$M97","v":0},null,null,null,{"$f":"Constants!$D96","v":40},{"$f":"SUMIF($O$14:$O$103,$P173,$V$14:$V$103)","v":0},{"$f":"(D97*$R$7)+(C97*$R$6)+(E97*$R$8)","v":0},{"$f":"IFERROR(($S97+$T97)*($G97+$H97*$R97/100)/$I97,0)","v":0},{"$f":"$S97+$T97-$U97","v":0}]
["15.d. Wet Pond #2 (Coastal Plain) (P-BAS-02)",{"$f":"Constants!$B97","v":0},null,null,null,{"$f":"SUMIF($O$14:$O$103,P174,$H$14:$H$103)","v":0},{"$f":"(Constants!$B$2*($G$7*$D98+$G$8*$E98+$C98*$G$6)*3630+$F98)*$B98/100","v":0},{"$f":"(Constants!$B$2*($G$7*$D98+$G$8*$E98+$C98*$G$6)*3630+$F98)*(1-$B98/100)","v":0},{"$f":"+$G98+$H98","v":0},{"$f":"Constants!C97","v":65},{"$f":"SUMIF($O$13:$O$103,P174,$N$13:$N$103)","v":0},{"$f":"(D98*$H$7)+(C98*$H$6)+(E98*$H$8)","v":0},{"$f":"IFERROR(($K98+$L98)*($G98+$H98*$J98/100)/$I98,0)","v":0},{"$f":"$K98+$L98-$M98","v":0},null,null,null,{"$f":"Constants!$D97","v":30},{"$f":"SUMIF($O$14:$O$103,$P174,$V$14:$V$103)","v":0},{"$f":"(D98*$R$7)+(C98*$R$6)+(E98*$R$8)","v":0},{"$f":"IFERROR(($S98+$T98)*($G98+$H98*$R98/100)/$I98,0)","v":0},{"$f":"$S98+$T98-$U98","v":0}]
[]
["16. Manufactured Treatment Devices (no RR)",null,null,null,null,null,null,null,null,null,null,null,null,null,null,null,null,"16. Manufactured BMP (no RR)"]
["16.a. Manufactured Treatment Device-Hydrodynamic",{"$f":"Constants!$B100","v":0},null,null,null,{"$f":"SUMIF($O$14:$O$103,P175,$H$14:$H$103)","v":0},{"$f":"(Constants!$B$2*($G$7*$D101+$G$8*$E101+$C101*$G$6)*3630+$F101)*$B101/100","v":0},{"$f":"(Constants!$B$2*($G$7*$D101+$G$8*$E101+$C101*$G$6)*3630+$F101)*(1-$B101/100)","v":0},{"$f":"+$G101+$H101","v":0},20,{"$f":"SUMIF($O$13:$O$103,P175,$N$13:$N$103)","v":0},{"$f":"(D101*$H$7)+(C101*$H$6)+(E101*$H$8)","v":0},{"$f":"IFERROR(($K101+$L101)*($G101+$H101*$J101/100)/$I101,0)","v":0},{"$f":"$K101+$L101-$M101","v":0},null,null,null,0,{"$f":"SUMIF($O$14:$O$103,$P175,$V$14:$V$103)","v":0},{"$f":"(D101*$R$7)+(C101*$R$6)+(E101*$R$8)","v":0},{"$f":"IFERROR(($S101+$T101)*($G101+$H101*$R101/100)/$I101,0)","v":0},{"$f":"$S101+$T101-$U101","v":0}]
["16.b. Manufactured Treatment Device-Filtering",{"$f":"Constants!$B101","v":0},null,null,null,{"$f":"SUMIF($O$14:$O$103,P176,$H$14:$H$103)","v":0},{"$f":"(Constants!$B$2*($G$7*$D102+$G$8*$E102+$C102*$G$6)*3630+$F102)*$B102/100","v":0},{"$f":"(Constants!$B$2*($G$7*$D102+$G$8*$E102+$C102*$G$6)*3630+$F102)*(1-$B102/100)","v":0},{"$f":"+$G102+$H102","v":0},20,{"$f":"SUMIF($O$13:$O$103,P176,$N$13:$N$103)","v":0},{"$f":"(D102*$H$7)+(C102*$H$6)+(E102*$H$8)","v":0},{"$f":"IFERROR(($K102+$L102)*($G102+$H102*$J102/100)/$I102,0)","v":0},{"$f":"$K102+$L102-$M102","v":0},null,null,null,0,{"$f":"SUMIF($O$14:$O$103,$P176,$V$14:$V$103)","v":0},{"$f":"(D102*$R$7)+(C102*$R$6)+(E102*$R$8)","v":0},{"$f":"IFERROR(($S102+$T102)*($G102+$H102*$R102/100)/$I102,0)","v":0},{"$f":"$S102+$T102-$U102","v":0}]
["16.c. Manufactured Treatment Device-Generic",{"$f":"Constants!$B102","v":0},null,null,null,{"$f":"SUMIF($O$14:$O$103,P177,$H$14:$H$103)","v":0},{"$f":"(Constants!$B$2*($G$7*$D103+$G$8*$E103+$C103*$G$6)*3630+$F103)*$B103/100","v":0},{"$f":"(Constants!$B$2*($G$7*$D103+$G$8*$E103+$C103*$G$6)*3630+$F103)*(1-$B103/100)","v":0},{"$f":"+$G103+$H103","v":0},20,{"$f":"SUMIF($O$13:$O$103,P177,$N$13:$N$103)","v":0},{"$f":"(D103*$H$7)+(C103*$H$6)+(E103*$H$8)","v":0},{"$f":"IFERROR(($K103+$L103)*($G103+$H103*$J103/100)/$I103,0)","v":0},{"$f":"$K103+$L103-$M103","v":0},null,null,null,0,{"$f":"SUMIF($O$14:$O$103,$P177,$V$14:$V$103)","v":0},{"$f":"(D103*$R$7)+(C103*$R$6)+(E103*$R$8)","v":0},{"$f":"IFERROR(($S103+$T103)*($G103+$H103*$R103/100)/$I103,0)","v":0},{"$f":"$S103+$T103-$U103","v":0}]
[]
[]
[]
[null,null,null,null,"TOTAL IMPERVIOUS COVER TREATED (ac)",{"$f":"SUM($E$14:$E$103)","v":0},"AREA CHECK:",{"$f":"IF($F$107>$F$8,\"AREA EXCEEDED!\",\"OK.\")","v":"OK."}]
[null,null,null,null,"TOTAL MIXED OPEN TREATED (ac)",{"$f":"SUM($C$14:$C$103)","v":0},"AREA CHECK:",{"$f":"IF($F$108>$F$6,\"AREA EXCEEDED!\",\"OK.\")","v":"OK."}]
[null,null,null,null,"TOTAL MANAGED TURF AREA TREATED (ac)",{"$f":"SUM($D$14:$D$103)","v":0},"AREA CHECK:",{"$f":"IF($F$109>$F$7,\"AREA EXCEEDED!\",\"OK.\")","v":"OK."}]
[]
[null,null,null,null,null,null,null,"TOTAL PHOSPHORUS REMOVAL REQUIRED ON SITE (lb/yr)",{"$f":"IF(Site!$E$21=\"Check Areas!\",\"ERROR - \",Site!$E$21)","v":0},{"$f":"IF(I111=\"ERROR - \",\"Site Data Tab\",\"\")","v":""}]
[]
[null,null,null,null,null,null,null,"TOTAL PHOSPHORUS AVAILABLE FOR REMOVAL IN D.A. D (lb/yr)",{"$f":"$N$8","v":0}]
[null,null,null,null,null,null,null,"TOTAL PHOSPHORUS REMOVED WITHOUT RUNOFF REDUCTION PRACTICES IN D.A. D (lb/yr)",{"$f":"SUM($M$83:$M$103)","v":0}]
[null,null,null,null,null,null,null,"TOTAL PHOSPHORUS REMOVED WITH RUNOFF REDUCTION PRACTICES IN D.A. D (lb/yr)",{"$f":"$I$74","v":0}]
[null,null,null,null,null,null,null,"TOTAL PHOSPHORUS LOAD REDUCTION ACHIEVED IN D.A. D (lb/yr)",{"$f":"$I$114+$I$115","v":0}]
[null,null,null,null,null,null,null,"TOTAL PHOSPHORUS REMAINING AFTER APPLYING BMP LOAD REDUCTIONS IN D.A. D (lb/yr)",{"$f":"$I$113-$I$116","v":0}]
[]
[null,null,"SEE WATER QUALITY COMPLIANCE TAB FOR SITE COMPLIANCE CALCULATIONS"]
[]
[null,null,null,null,null,null,null,"NITROGEN REMOVED WITH RUNOFF REDUCTION PRACTICES IN D.A. D (lb/yr)",{"$f":"IFERROR(SUM($U$14:$U$65),0)","v":0}]
[null,null,null,null,null,null,null,"NITROGEN REMOVED WITHOUT RUNOFF REDUCTION PRACTICES IN D.A. D (lb/yr)",{"$f":"SUM($U$83:$U$103)","v":0}]
[null,null,null,null,null,null,null,"TOTAL NITROGEN REMOVED IN D.A. D (lb/yr)",{"$f":"$I$121+$I$122","v":0}]
[]
[]
[]
[]
[]
[]
[]
[null,null,"Downstream Practices - Dropdown selections for each applicable BMP"]
[]
["Options for 1. Green Roof",null,"Options for 2. Impervious Surface Disconnection",null,"Options for 3a. Pervious Parking, A/B Soils",null,"Options for 4a. Grass Channels, A/B Soils",null,null,"Options for 4b. Grass Channels, C/D Soils"]
[null,null,null,null,null,null,null,null,null,null,null,"Options for 4.c. Grass Channel Compost Amended Soils",null,null,null,"Master Downstream BMP Reference List"]
[{"$f":"P135","v":"None"},null,{"$f":"P135","v":"None"},null,{"$f":"P135","v":"None"},null,{"$f":"P135","v":"None"},null,null,{"$f":"P135","v":"None"},null,null,null,null,null,"None"]
["2.a. Simple Disconnection to A/B Soils",null,{"$f":"P146","v":"4.a. Grass Channel A/B Soils"},null,{"$f":"P146","v":"4.a. Grass Channel A/B Soils"},null,{"$f":"P147","v":"4.b. Grass Channel C/D Soils"},null,null,{"$f":"P146","v":"4.a. Grass Channel A/B Soils"},null,{"$f":"P135","v":"None"},null,null,null,"2.a. Simple Disconnection to A/B Soils"]
["2.b. Simple Disconnection to C/D Soils",null,"4.b. Grass Channel C/D Soils",null,"4.b. Grass Channel C/D Soils",null,"4.c. Grass Channel Compost Amended Soils",null,null,{"$f":"P148","v":"4.c. Grass Channel Compost Amended Soils"},null,{"$f":"P146","v":"4.a. Grass Channel A/B Soils"},null,null,null,"2.b. Simple Disconnection to C/D Soils"]
["2.c. To Soil Amended Filter Path",null,"4.c. Grass Channel Compost Amended Soils",null,"4.c. Grass Channel Compost Amended Soils",null,"5.a. Dry Swale #1",null,null,"5.a. Dry Swale #1",null,{"$f":"P147","v":"4.b. Grass Channel C/D Soils"},null,null,null,"2.c. To Soil Amended Filter Path"]
["2.d. To Dry Well/French Drain #1 (Micro-Infiltration #1)",null,"5.a. Dry Swale #1",null,"5.a. Dry Swale #1",null,"5.b. Dry Swale #2",null,null,"5.b. Dry Swale #2",null,{"$f":"P149","v":"5.a. Dry Swale #1"},null,null,null,"2.d. To Dry Well/French Drain #1 (Micro-Infiltration #1)"]
["2.e. To Dry Well/French Drain #2 (Micro-Infiltration. #2)",null,"5.b. Dry Swale #2",null,"5.b. Dry Swale #2",null,"6.a. Bioretention #1",null,null,"6.a. Bioretention #1",null,"5.b. Dry Swale #2",null,null,null,"2.e. To Dry Well/French Drain #2 (Micro-Infiltration. #2)"]
["2.f. To Rain Garden #1 (Micro-Bioretention #1)",null,"6.a. Bioretention #1",null,"6.a. Bioretention #1",null,"6.b. Bioretention #2",null,null,"6.b. Bioretention #2",null,"6.a. Bioretention #1",null,null,null,"2.f. To Rain Garden #1 (Micro-Bioretention #1)"]
["2.g. To Rain Garden #2 (Micro-Bioretention #2)",null,"6.b. Bioretention #2",null,"6.b. Bioretention #2",null,"7.a. Infiltration #1",null,null,"7.a. Infiltration #1",null,"6.b. Bioretention #2",null,null,null,"2.g. To Rain Garden #2 (Micro-Bioretention #2)"]
["2.h. To Train Barrel, Rain Tank, or Cistern",null,"7.a. Infiltration #1",null,"7.a. Infiltration #1",null,"7.b. Infiltration #2",null,null,"7.b. Infiltration #2",null,"7.a. Infiltration #1",null,null,null,"2.h. To Train Barrel, Rain Tank, or Cistern"]
["2.i. To Stormwater Planter (Urban Bioretention)",null,"7.b. Infiltration #2",null,"7.b. Infiltration #2",null,"8.a. ED #1",null,null,"8.a. ED #1",null,"7.b. Infiltration #2",null,null,null,"2.i. To Stormwater Planter (Urban Bioretention)"]
["3.a. Permeable Pavement #1",null,"8.a. ED #1",null,"8.a. ED #1",null,"8.b. ED #2",null,null,"8.b. ED #2",null,"8.a. ED #1",null,null,null,"3.a. Permeable Pavement #1"]
["4.a. Grass Channel A/B Soils",null,"8.b. ED #2",null,"8.b. ED #2",null,"9.a. Sheetflow to A/B Soil Conservation Area ",null,null,"9.a. Sheetflow to A/B Soil Conservation Area ",null,"8.b. ED #2",null,null,null,"4.a. Grass Channel A/B Soils"]
["4.b. Grass Channel C/D Soils",null,"9.a. Sheetflow to A/B Soil Conservation Area ",null,"9.a. Sheetflow to A/B Soil Conservation Area ",null,"9.b. Sheetflow to C/D Soil Conservation Area",null,null,"9.b. Sheetflow to C/D Soil Conservation Area",null,"9.a. Sheetflow to A/B Soil Conservation Area ",null,null,null,"4.b. Grass Channel C/D Soils"]
["4.c. Grass Channel Compost Amended Soils",null,"9.b. Sheetflow to C/D Soil Conservation Area",null,"9.b. Sheetflow to C/D Soil Conservation Area",null,"9.c. Sheetflow to Vegetated Filter Strip",null,null,"9.c. Sheetflow to Vegetated Filter Strip",null,"9.b. Sheetflow to C/D Soil Conservation Area",null,null,null,"4.c. Grass Channel Compost Amended Soils"]
["5.a. Dry Swale #1",null,"9.c. Sheetflow to Vegetated Filter Strip",null,"9.c. Sheetflow to Vegetated Filter Strip",null,"10.a. Regenerative Stormwater Conveyance #1",null,null,"10.a. Regenerative Stormwater Conveyance #1",null,"9.c. Sheetflow to Vegetated Filter Strip",null,null,null,"5.a. Dry Swale #1"]
["5.b. Dry Swale #2",null,"10.a. Regenerative Stormwater Conveyance #1",null,"10.a. Regenerative Stormwater Conveyance #1",null,"10.b. Regenerative Stormwater Conveyance #2",null,null,"10.b. Regenerative Stormwater Conveyance #2",null,"10.a. Regenerative Stormwater Conveyance #1",null,null,null,"5.b. Dry Swale #2"]
["6.a. Bioretention #1",null,"10.b. Regenerative Stormwater Conveyance #2",null,"10.b. Regenerative Stormwater Conveyance #2",null,{"$f":"P165","v":"12.a. Wet Swale #1"},null,null,{"$f":"P165","v":"12.a. Wet Swale #1"},null,"10.b. Regenerative Stormwater Conveyance #2",null,null,null,"6.a. Bioretention #1"]
["6.b. Bioretention #2",null,{"$f":"P165","v":"12.a. Wet Swale #1"},null,{"$f":"P165","v":"12.a. Wet Swale #1"},null,"12.b. Wet Swale #2",null,null,"12.b. Wet Swale #2",null,{"$f":"P165","v":"12.a. Wet Swale #1"},null,null,null,"6.b. Bioretention #2"]
["7.a. Infiltration #1",null,"12.b. Wet Swale #2",null,"12.b. Wet Swale #2",null,"13.a. Filtering Practice #1",null,null,"13.a. Filtering Practice #1",null,"12.b. Wet Swale #2",null,null,null,"7.a. Infiltration #1"]
["7.b. Infiltration #2",null,"13.a. Filtering Practice #1",null,"13.a. Filtering Practice #1",null,"13.b. Filtering Practice #2",null,null,"13.b. Filtering Practice #2",null,"13.a. Filtering Practice #1",null,null,null,"7.b. Infiltration #2"]
["8.a. ED #1",null,"13.b. Filtering Practice #2",null,"13.b. Filtering Practice #2",null,"14.a. Constructed Wetland #1",null,null,"14.a. Constructed Wetland #1",null,"13.b. Filtering Practice #2",null,null,null,"8.a. ED #1"]
["8.b. ED #2",null,"14.a. Constructed Wetland #1",null,"14.a. Constructed Wetland #1",null,"14.b. Constructed Wetland #2",null,null,"14.b. Constructed Wetland #2",null,"14.a. Constructed Wetland #1",null,null,null,"8.b. ED #2"]
["9.a. Sheetflow to A/B Soil Conservation Area ",null,"14.b. Constructed Wetland #2",null,"14.b. Constructed Wetland #2",null,"15.a. Wet Pond #1",null,null,"15.a. Wet Pond #1",null,"14.b. Constructed Wetland #2",null,null,null,"9.a. Sheetflow to A/B Soil Conservation Area "]
["9.b. Sheetflow to C/D Soil Conservation Area",null,"15.a. Wet Pond #1",null,"15.a. Wet Pond #1",null,"15.b. Wet Pond #1 (Coastal Plain)",null,null,"15.b. Wet Pond #1 (Coastal Plain)",null,"15.a. Wet Pond #1",null,null,null,"9.b. Sheetflow to C/D Soil Conservation Area"]
["9.c. Sheetflow to Vegetated Filter Strip",null,"15.b. Wet Pond #1 (Coastal Plain)",null,"15.b. Wet Pond #1 (Coastal Plain)",null,"15.c. Wet Pond #2",null,null,"15.c. Wet Pond #2",null,"15.b. Wet Pond #1 (Coastal Plain)",null,null,null,"9.c. Sheetflow to Vegetated Filter Strip"]
["10.a. Regenerative Stormwater Conveyance #1",null,"15.c. Wet Pond #2",null,"15.c. Wet Pond #2",null,"15.d. Wet Pond #2 (Coastal Plain)",null,null,"15.d. Wet Pond #2 (Coastal Plain)",null,"15.c. Wet Pond #2",null,null,null,"10.a. Regenerative Stormwater Conveyance #1"]
["10.b. Regenerative Stormwater Conveyance #2",null,"15.d. Wet Pond #2 (Coastal Plain)",null,"15.d. Wet Pond #2 (Coastal Plain)",null,"16.a. MTD - Hydrodynamic",null,null,"16.a. MTD - Hydrodynamic",null,"15.d. Wet Pond #2 (Coastal Plain)",null,null,null,"10.b. Regenerative Stormwater Conveyance #2"]
[{"$f":"P165","v":"12.a. Wet Swale #1"},null,"16.a. MTD - Hydrodynamic",null,"16.a. MTD - Hydrodynamic",null,"16.b. MTD - Filtering",null,null,"16.b. MTD - Filtering",null,"16.a. MTD - Hydrodynamic",null,null,null,"11.a. Trees over Pervious, A/B"]
["12.b. Wet Swale #2",null,"16.b. MTD - Filtering",null,"16.b. MTD - Filtering",null,"16.c. MTD - Generic",null,null,"16.c. MTD - Generic",null,"16.b. MTD - Filtering",null,null,null,"11.b. Trees over Pervious, B/C"]
["13.a. Filtering Practice #1",null,"16.c. MTD - Generic",null,"16.c. MTD - Generic",null,null,null,null,null,null,"16.c. MTD - Generic",null,null,null,"11.c. Trees over Impervious"]
["13.b. Filtering Practice #2",null,null,null,null,null,null,null,null,null,null,null,null,null,null,"12.a. Wet Swale #1"]
["14.a. Constructed Wetland #1",null,null,null,null,null,null,null,null,null,null,null,null,null,null,"12.b. Wet Swale #2"]
["14.b. Constructed Wetland #2",null,null,null,null,null,null,null,null,null,null,null,null,null,null,"13.a. Filtering Practice #1"]
["15.a. Wet Pond #1",null,null,null,null,null,null,null,null,null,null,null,null,null,null,"13.b. Filtering Practice #2"]
["15.b. Wet Pond #1 (Coastal Plain)",null,null,null,null,null,null,null,null,null,null,null,null,null,null,"14.a. Constructed Wetland #1"]
["15.c. Wet Pond #2",null,null,null,null,null,null,null,null,null,null,null,null,null,null,"14.b. Constructed Wetland #2"]
["15.d. Wet Pond #2 (Coastal Plain)",null,null,null,null,null,null,null,null,null,null,null,null,null,null,"15.a. Wet Pond #1"]
["16.a. MTD - Hydrodynamic",null,null,null,null,null,null,null,null,null,null,null,null,null,null,"15.b. Wet Pond #1 (Coastal Plain)"]
["16.b. MTD - Filtering",null,null,null,null,null,null,null,null,null,null,null,null,null,null,"15.c. Wet Pond #2"]
["16.c. MTD - Generic",null,null,null,null,null,null,null,null,null,null,null,null,null,null,"15.d. Wet Pond #2 (Coastal Plain)"]
[null,null,null,null,null,null,null,null,null,null,null,null,null,null,null,"16.a. MTD - Hydrodynamic"]
["Options for 5a. Dry Swale #1",null,"Options for 5b. Dry Swale #2",null,"Options for 6a. Bioretention #1",null,"Options for 6b. Bioretention #2",null,null,"Options for 7a. Infiltration #1",null,"Options for 7b. Infiltration #2",null,null,null,"16.b. MTD - Filtering"]
[null,null,null,null,null,null,null,null,null,null,null,null,null,null,null,"16.c. MTD - Generic"]
[{"$f":"P135","v":"None"},null,{"$f":"P135","v":"None"},null,{"$f":"P135","v":"None"},null,{"$f":"P135","v":"None"},null,null,{"$f":"P135","v":"None"},null,{"$f":"P135","v":"None"}]
[{"$f":"P146","v":"4.a. Grass Channel A/B Soils"},null,{"$f":"P146","v":"4.a. Grass Channel A/B Soils"},null,{"$f":"P146","v":"4.a. Grass Channel A/B Soils"},null,{"$f":"P146","v":"4.a. Grass Channel A/B Soils"},null,null,{"$f":"P146","v":"4.a. Grass Channel A/B Soils"},null,{"$f":"P146","v":"4.a. Grass Channel A/B Soils"}]
[{"$f":"P147","v":"4.b. Grass Channel C/D Soils"},null,{"$f":"P147","v":"4.b. Grass Channel C/D Soils"},null,{"$f":"P147","v":"4.b. Grass Channel C/D Soils"},null,"4.b. Grass Channel C/D Soils",null,null,"4.b. Grass Channel C/D Soils",null,"4.b. Grass Channel C/D Soils"]
[{"$f":"P148","v":"4.c. Grass Channel Compost Amended Soils"},null,{"$f":"P148","v":"4.c. Grass Channel Compost Amended Soils"},null,{"$f":"P148","v":"4.c. Grass Channel Compost Amended Soils"},null,"4.c. Grass Channel Compost Amended Soils",null,null,"4.c. Grass Channel Compost Amended Soils",null,"4.c. Grass Channel Compost Amended Soils"]
[{"$f":"P150","v":"5.b. Dry Swale #2"},null,{"$f":"P149","v":"5.a. Dry Swale #1"},null,{"$f":"P149","v":"5.a. Dry Swale #1"},null,"5.a. Dry Swale #1",null,null,"5.a. Dry Swale #1",null,"5.a. Dry Swale #1"]
["6.a. Bioretention #1",null,{"$f":"P151","v":"6.a. Bioretention #1"},null,{"$f":"P150","v":"5.b. Dry Swale #2"},null,"5.b. Dry Swale #2",null,null,"5.b. Dry Swale #2",null,"5.b. Dry Swale #2"]
["6.b. Bioretention #2",null,"6.b. Bioretention #2",null,{"$f":"P152","v":"6.b. Bioretention #2"},null,"6.a. Bioretention #1",null,null,"6.a. Bioretention #1",null,"6.a. Bioretention #1"]
["7.a. Infiltration #1",null,"7.a. Infiltration #1",null,"7.a. Infiltration #1",null,{"$f":"P153","v":"7.a. Infiltration #1"},null,null,"6.b. Bioretention #2",null,"6.b. Bioretention #2"]
["7.b. Infiltration #2",null,"7.b. Infiltration #2",null,"7.b. Infiltration #2",null,"7.b. Infiltration #2",null,null,{"$f":"P154","v":"7.b. Infiltration #2"},null,"7.a. Infiltration #1"]
["8.a. ED #1",null,"8.a. ED #1",null,"8.a. ED #1",null,"8.a. ED #1",null,null,"8.a. ED #1",null,{"$f":"P155","v":"8.a. ED #1"}]
["8.b. ED #2",null,"8.b. ED #2",null,"8.b. ED #2",null,"8.b. ED #2",null,null,"8.b. ED #2",null,"8.b. ED #2"]
["9.a. Sheetflow to A/B Soil Conservation Area ",null,"9.a. Sheetflow to A/B Soil Conservation Area ",null,"9.a. Sheetflow to A/B Soil Conservation Area ",null,"9.a. Sheetflow to A/B Soil Conservation Area ",null,null,"9.a. Sheetflow to A/B Soil Conservation Area ",null,"9.a. Sheetflow to A/B Soil Conservation Area "]
["9.b. Sheetflow to C/D Soil Conservation Area",null,"9.b. Sheetflow to C/D Soil Conservation Area",null,"9.b. Sheetflow to C/D Soil Conservation Area",null,"9.b. Sheetflow to C/D Soil Conservation Area",null,null,"9.b. Sheetflow to C/D Soil Conservation Area",null,"9.b. Sheetflow to C/D Soil Conservation Area"]
["9.c. Sheetflow to Vegetated Filter Strip",null,"9.c. Sheetflow to Vegetated Filter Strip",null,"9.c. Sheetflow to Vegetated Filter Strip",null,"9.c. Sheetflow to Vegetated Filter Strip",null,null,"9.c. Sheetflow to Vegetated Filter Strip",null,"9.c. Sheetflow to Vegetated Filter Strip"]
["10.a. Regenerative Stormwater Conveyance #1",null,"10.a. Regenerative Stormwater Conveyance #1",null,"10.a. Regenerative Stormwater Conveyance #1",null,"10.a. Regenerative Stormwater Conveyance #1",null,null,"10.a. Regenerative Stormwater Conveyance #1",null,"10.a. Regenerative Stormwater Conveyance #1"]
["10.b. Regenerative Stormwater Conveyance #2",null,"10.b. Regenerative Stormwater Conveyance #2",null,"10.b. Regenerative Stormwater Conveyance #2",null,"10.b. Regenerative Stormwater Conveyance #2",null,null,"10.b. Regenerative Stormwater Conveyance #2",null,"10.b. Regenerative Stormwater Conveyance #2"]
[{"$f":"P165","v":"12.a. Wet Swale #1"},null,{"$f":"P165","v":"12.a. Wet Swale #1"},null,{"$f":"P165","v":"12.a. Wet Swale #1"},null,{"$f":"P165","v":"12.a. Wet Swale #1"},null,null,{"$f":"P165","v":"12.a. Wet Swale #1"},null,{"$f":"P165","v":"12.a. Wet Swale #1"}]
["12.b. Wet Swale #2",null,"12.b. Wet Swale #2",null,"12.b. Wet Swale #2",null,"12.b. Wet Swale #2",null,null,"12.b. Wet Swale #2",null,"12.b. Wet Swale #2"]
["13.a. Filtering Practice #1",null,"13.a. Filtering Practice #1",null,"13.a. Filtering Practice #1",null,"13.a. Filtering Practice #1",null,null,"13.a. Filtering Practice #1",null,"13.a. Filtering Practice #1"]
["13.b. Filtering Practice #2",null,"13.b. Filtering Practice #2",null,"13.b. Filtering Practice #2",null,"13.b. Filtering Practice #2",null,null,"13.b. Filtering Practice #2",null,"13.b. Filtering Practice #2"]
["14.a. Constructed Wetland #1",null,"14.a. Constructed Wetland #1",null,"14.a. Constructed Wetland #1",null,"14.a. Constructed Wetland #1",null,null,"14.a. Constructed Wetland #1",null,"14.a. Constructed Wetland #1"]
["14.b. Constructed Wetland #2",null,"14.b. Constructed Wetland #2",null,"14.b. Constructed Wetland #2",null,"14.b. Constructed Wetland #2",null,null,"14.b. Constructed Wetland #2",null,"14.b. Constructed Wetland #2"]
["15.a. Wet Pond #1",null,"15.a. Wet Pond #1",null,"15.a. Wet Pond #1",null,"15.a. Wet Pond #1",null,null,"15.a. Wet Pond #1",null,"15.a. Wet Pond #1"]
["15.b. Wet Pond #1 (Coastal Plain)",null,"15.b. Wet Pond #1 (Coastal Plain)",null,"15.b. Wet Pond #1 (Coastal Plain)",null,"15.b. Wet Pond #1 (Coastal Plain)",null,null,"15.b. Wet Pond #1 (Coastal Plain)",null,"15.b. Wet Pond #1 (Coastal Plain)"]
["15.c. Wet Pond #2",null,"15.c. Wet Pond #2",null,"15.c. Wet Pond #2",null,"15.c. Wet Pond #2",null,null,"15.c. Wet Pond #2",null,"15.c. Wet Pond #2"]
["15.d. Wet Pond #2 (Coastal Plain)",null,"15.d. Wet Pond #2 (Coastal Plain)",null,"15.d. Wet Pond #2 (Coastal Plain)",null,"15.d. Wet Pond #2 (Coastal Plain)",null,null,"15.d. Wet Pond #2 (Coastal Plain)",null,"15.d. Wet Pond #2 (Coastal Plain)"]
["16.a. MTD - Hydrodynamic",null,"16.a. MTD - Hydrodynamic",null,"16.a. MTD - Hydrodynamic",null,"16.a. MTD - Hydrodynamic",null,null,"16.a. MTD - Hydrodynamic",null,"16.a. MTD - Hydrodynamic"]
["16.b. MTD - Filtering",null,"16.b. MTD - Filtering",null,"16.b. MTD - Filtering",null,"16.b. MTD - Filtering",null,null,"16.b. MTD - Filtering",null,"16.b. MTD - Filtering"]
["16.c. MTD - Generic",null,"16.c. MTD - Generic",null,"16.c. MTD - Generic",null,"16.c. MTD - Generic",null,null,"16.c. MTD - Generic",null,"16.c. MTD - Generic"]
[]
["Options for 8a. Extended Detention #1",null,"Options for 8b. Extended Detention #2",null,"Options for 9 Sheet Flow to Open Space",null,"Options for 9c. Sheet Flow to Filter Strip",null,null,"Options for 10a. Wet Swale #1",null,"Options for 10b. Wet Swale #2"]
[]
[{"$f":"P135","v":"None"},null,{"$f":"P135","v":"None"},null,{"$f":"P135","v":"None"},null,{"$f":"P135","v":"None"},null,null,{"$f":"P135","v":"None"},null,{"$f":"P135","v":"None"}]
[{"$f":"P146","v":"4.a. Grass Channel A/B Soils"},null,{"$f":"P146","v":"4.a. Grass Channel A/B Soils"},null,null,null,{"$f":"P146","v":"4.a. Grass Channel A/B Soils"},null,null,{"$f":"P146","v":"4.a. Grass Channel A/B Soils"},null,{"$f":"P146","v":"4.a. Grass Channel A/B Soils"}]
["4.b. Grass Channel C/D Soils",null,"4.b. Grass Channel C/D Soils",null,null,null,"4.b. Grass Channel C/D Soils",null,null,"4.b. Grass Channel C/D Soils",null,"4.b. Grass Channel C/D Soils"]
["4.c. Grass Channel Compost Amended Soils",null,"4.c. Grass Channel Compost Amended Soils",null,null,null,"4.c. Grass Channel Compost Amended Soils",null,null,"4.c. Grass Channel Compost Amended Soils",null,"4.c. Grass Channel Compost Amended Soils"]
["5.a. Dry Swale #1",null,"5.a. Dry Swale #1",null,null,null,"5.a. Dry Swale #1",null,null,"5.a. Dry Swale #1",null,"5.a. Dry Swale #1"]
["5.b. Dry Swale #2",null,"5.b. Dry Swale #2",null,null,null,"5.b. Dry Swale #2",null,null,"5.b. Dry Swale #2",null,"5.b. Dry Swale #2"]
["6.a. Bioretention #1",null,"6.a. Bioretention #1",null,null,null,"6.a. Bioretention #1",null,null,"6.a. Bioretention #1",null,"6.a. Bioretention #1"]
["6.b. Bioretention #2",null,"6.b. Bioretention #2",null,null,null,"6.b. Bioretention #2",null,null,"6.b. Bioretention #2",null,"6.b. Bioretention #2"]
["7.a. Infiltration #1",null,"7.a. Infiltration #1",null,null,null,"7.a. Infiltration #1",null,null,"7.a. Infiltration #1",null,"7.a. Infiltration #1"]
["7.b. Infiltration #2",null,"7.b. Infiltration #2",null,null,null,"7.b. Infiltration #2",null,null,"7.b. Infiltration #2",null,"7.b. Infiltration #2"]
[{"$f":"P156","v":"8.b. ED #2"},null,"8.a. ED #1",null,null,null,"8.a. ED #1",null,null,"8.a. ED #1",null,"8.a. ED #1"]
["9.a. Sheetflow to A/B Soil Conservation Area ",null,{"$f":"P157","v":"9.a. Sheetflow to A/B Soil Conservation Area "},null,null,null,"8.b. ED #2",null,null,"8.b. ED #2",null,"8.b. ED #2"]
["9.b. Sheetflow to C/D Soil Conservation Area",null,"9.b. Sheetflow to C/D Soil Conservation Area",null,null,null,"9.a. Sheetflow to A/B Soil Conservation Area ",null,null,"9.a. Sheetflow to A/B Soil Conservation Area ",null,"9.a. Sheetflow to A/B Soil Conservation Area "]
["9.c. Sheetflow to Vegetated Filter Strip",null,"9.c. Sheetflow to Vegetated Filter Strip",null,null,null,"9.b. Sheetflow to C/D Soil Conservation Area",null,null,"9.b. Sheetflow to C/D Soil Conservation Area",null,"9.b. Sheetflow to C/D Soil Conservation Area"]
["10.a. Regenerative Stormwater Conveyance #1",null,"10.a. Regenerative Stormwater Conveyance #1",null,null,null,{"$f":"P160","v":"10.a. Regenerative Stormwater Conveyance #1"},null,null,"9.c. Sheetflow to Vegetated Filter Strip",null,"9.c. Sheetflow to Vegetated Filter Strip"]
["10.b. Regenerative Stormwater Conveyance #2",null,"10.b. Regenerative Stormwater Conveyance #2",null,null,null,{"$f":"P161","v":"10.b. Regenerative Stormwater Conveyance #2"},null,null,"10.a. Regenerative Stormwater Conveyance #1",null,"10.a. Regenerative Stormwater Conveyance #1"]
[{"$f":"P165","v":"12.a. Wet Swale #1"},null,{"$f":"P165","v":"12.a. Wet Swale #1"},null,null,null,{"$f":"P165","v":"12.a. Wet Swale #1"},null,null,"10.b. Regenerative Stormwater Conveyance #2",null,"10.b. Regenerative Stormwater Conveyance #2"]
["12.b. Wet Swale #2",null,"12.b. Wet Swale #2",null,null,null,"12.b. Wet Swale #2",null,null,{"$f":"P166","v":"12.b. Wet Swale #2"},null,{"$f":"P165","v":"12.a. Wet Swale #1"}]
["13.a. Filtering Practice #1",null,"13.a. Filtering Practice #1",null,null,null,"13.a. Filtering Practice #1",null,null,"13.a. Filtering Practice #1",null,{"$f":"P167","v":"13.a. Filtering Practice #1"}]
["13.b. Filtering Practice #2",null,"13.b. Filtering Practice #2",null,null,null,"13.b. Filtering Practice #2",null,null,"13.b. Filtering Practice #2",null,"13.b. Filtering Practice #2"]
["14.a. Constructed Wetland #1",null,"14.a. Constructed Wetland #1",null,null,null,"14.a. Constructed Wetland #1",null,null,"14.a. Constructed Wetland #1",null,"14.a. Constructed Wetland #1"]
["14.b. Constructed Wetland #2",null,"14.b. Constructed Wetland #2",null,null,null,"14.b. Constructed Wetland #2",null,null,"14.b. Constructed Wetland #2",null,"14.b. Constructed Wetland #2"]
["15.a. Wet Pond #1",null,"15.a. Wet Pond #1",null,null,null,"15.a. Wet Pond #1",null,null,"15.a. Wet Pond #1",null,"15.a. Wet Pond #1"]
["15.b. Wet Pond #1 (Coastal Plain)",null,"15.b. Wet Pond #1 (Coastal Plain)",null,null,null,"15.b. Wet Pond #1 (Coastal Plain)",null,null,"15.b. Wet Pond #1 (Coastal Plain)",null,"15.b. Wet Pond #1 (Coastal Plain)"]
["15.c. Wet Pond #2",null,"15.c. Wet Pond #2",null,null,null,"15.c. Wet Pond #2",null,null,"15.c. Wet Pond #2",null,"15.c. Wet Pond #2"]
["15.d. Wet Pond #2 (Coastal Plain)",null,"15.d. Wet Pond #2 (Coastal Plain)",null,null,null,"15.d. Wet Pond #2 (Coastal Plain)",null,null,"15.d. Wet Pond #2 (Coastal Plain)",null,"15.d. Wet Pond #2 (Coastal Plain)"]
["16.a. MTD - Hydrodynamic",null,"16.a. MTD - Hydrodynamic",null,null,null,"16.a. MTD - Hydrodynamic",null,null,"16.a. MTD - Hydrodynamic",null,"16.a. MTD - Hydrodynamic"]
["16.b. MTD - Filtering",null,"16.b. MTD - Filtering",null,null,null,"16.b. MTD - Filtering",null,null,"16.b. MTD - Filtering",null,"16.b. MTD - Filtering"]
["16.c. MTD - Generic",null,"16.c. MTD - Generic",null,null,null,"16.c. MTD - Generic",null,null,"16.c. MTD - Generic",null,"16.c. MTD - Generic"]
[]
[]
[]
["Options for 11 A.  Filtering Practice #1",null,"Options for 11 b.  Filtering Practice #2",null,"Options for 12.a.  Constructed Wetland #1",null,"Options for 12.b.  Constructed Wetland #2",null,null,"Options for 13.a.  Wet Pond #1",null,"Options for 13.b.  Wet Pond #1 (Coastal Plain)"]
[null,null,null,null,null,null,null,null,null,{"$f":"P135","v":"None"},null,{"$f":"P135","v":"None"}]
[{"$f":"P135","v":"None"},null,{"$f":"P135","v":"None"},null,{"$f":"P135","v":"None"},null,{"$f":"P135","v":"None"},null,null,{"$f":"P146","v":"4.a. Grass Channel A/B Soils"},null,{"$f":"P146","v":"4.a. Grass Channel A/B Soils"}]
[{"$f":"P146","v":"4.a. Grass Channel A/B Soils"},null,{"$f":"P146","v":"4.a. Grass Channel A/B Soils"},null,{"$f":"P146","v":"4.a. Grass Channel A/B Soils"},null,{"$f":"P146","v":"4.a. Grass Channel A/B Soils"},null,null,"4.b. Grass Channel C/D Soils",null,"4.b. Grass Channel C/D Soils"]
["4.b. Grass Channel C/D Soils",null,"4.b. Grass Channel C/D Soils",null,"4.b. Grass Channel C/D Soils",null,"4.b. Grass Channel C/D Soils",null,null,"4.c. Grass Channel Compost Amended Soils",null,"4.c. Grass Channel Compost Amended Soils"]
["4.c. Grass Channel Compost Amended Soils",null,"4.c. Grass Channel Compost Amended Soils",null,"4.c. Grass Channel Compost Amended Soils",null,"4.c. Grass Channel Compost Amended Soils",null,null,"5.a. Dry Swale #1",null,"5.a. Dry Swale #1"]
["5.a. Dry Swale #1",null,"5.a. Dry Swale #1",null,"5.a. Dry Swale #1",null,"5.a. Dry Swale #1",null,null,"5.b. Dry Swale #2",null,"5.b. Dry Swale #2"]
["5.b. Dry Swale #2",null,"5.b. Dry Swale #2",null,"5.b. Dry Swale #2",null,"5.b. Dry Swale #2",null,null,"6.a. Bioretention #1",null,"6.a. Bioretention #1"]
["6.a. Bioretention #1",null,"6.a. Bioretention #1",null,"6.a. Bioretention #1",null,"6.a. Bioretention #1",null,null,"6.b. Bioretention #2",null,"6.b. Bioretention #2"]
["6.b. Bioretention #2",null,"6.b. Bioretention #2",null,"6.b. Bioretention #2",null,"6.b. Bioretention #2",null,null,"7.a. Infiltration #1",null,"7.a. Infiltration #1"]
["7.a. Infiltration #1",null,"7.a. Infiltration #1",null,"7.a. Infiltration #1",null,"7.a. Infiltration #1",null,null,"7.b. Infiltration #2",null,"7.b. Infiltration #2"]
["7.b. Infiltration #2",null,"7.b. Infiltration #2",null,"7.b. Infiltration #2",null,"7.b. Infiltration #2",null,null,"8.a. ED #1",null,"8.a. ED #1"]
["8.a. ED #1",null,"8.a. ED #1",null,"8.a. ED #1",null,"8.a. ED #1",null,null,"8.b. ED #2",null,"8.b. ED #2"]
["8.b. ED #2",null,"8.b. ED #2",null,"8.b. ED #2",null,"8.b. ED #2",null,null,"9.a. Sheetflow to A/B Soil Conservation Area ",null,"9.a. Sheetflow to A/B Soil Conservation Area "]
["9.a. Sheetflow to A/B Soil Conservation Area ",null,"9.a. Sheetflow to A/B Soil Conservation Area ",null,"9.a. Sheetflow to A/B Soil Conservation Area ",null,"9.a. Sheetflow to A/B Soil Conservation Area ",null,null,"9.b. Sheetflow to C/D Soil Conservation Area",null,"9.b. Sheetflow to C/D Soil Conservation Area"]
["9.b. Sheetflow to C/D Soil Conservation Area",null,"9.b. Sheetflow to C/D Soil Conservation Area",null,"9.b. Sheetflow to C/D Soil Conservation Area",null,"9.b. Sheetflow to C/D Soil Conservation Area",null,null,"9.c. Sheetflow to Vegetated Filter Strip",null,"9.c. Sheetflow to Vegetated Filter Strip"]
["9.c. Sheetflow to Vegetated Filter Strip",null,"9.c. Sheetflow to Vegetated Filter Strip",null,"9.c. Sheetflow to Vegetated Filter Strip",null,"9.c. Sheetflow to Vegetated Filter Strip",null,null,"10.a. Regenerative Stormwater Conveyance #1",null,"10.a. Regenerative Stormwater Conveyance #1"]
[{"$f":"P165","v":"12.a. Wet Swale #1"},null,"10.a. Regenerative Stormwater Conveyance #1",null,"10.a. Regenerative Stormwater Conveyance #1",null,"10.a. Regenerative Stormwater Conveyance #1",null,null,"10.b. Regenerative Stormwater Conveyance #2",null,"10.b. Regenerative Stormwater Conveyance #2"]
[{"$f":"P166","v":"12.b. Wet Swale #2"},null,"10.b. Regenerative Stormwater Conveyance #2",null,"10.b. Regenerative Stormwater Conveyance #2",null,"10.b. Regenerative Stormwater Conveyance #2",null,null,{"$f":"P165","v":"12.a. Wet Swale #1"},null,{"$f":"P165","v":"12.a. Wet Swale #1"}]
[{"$f":"P168","v":"13.b. Filtering Practice #2"},null,{"$f":"P165","v":"12.a. Wet Swale #1"},null,{"$f":"P165","v":"12.a. Wet Swale #1"},null,{"$f":"P165","v":"12.a. Wet Swale #1"},null,null,"12.b. Wet Swale #2",null,"12.b. Wet Swale #2"]
["14.a. Constructed Wetland #1",null,{"$f":"P166","v":"12.b. Wet Swale #2"},null,{"$f":"P166","v":"12.b. Wet Swale #2"},null,{"$f":"P166","v":"12.b. Wet Swale #2"},null,null,"13.a. Filtering Practice #1",null,"13.a. Filtering Practice #1"]
["14.b. Constructed Wetland #2",null,{"$f":"P167","v":"13.a. Filtering Practice #1"},null,{"$f":"P167","v":"13.a. Filtering Practice #1"},null,{"$f":"P167","v":"13.a. Filtering Practice #1"},null,null,"13.b. Filtering Practice #2",null,"13.b. Filtering Practice #2"]
["15.a. Wet Pond #1",null,{"$f":"P169","v":"14.a. Constructed Wetland #1"},null,{"$f":"P168","v":"13.b. Filtering Practice #2"},null,{"$f":"P168","v":"13.b. Filtering Practice #2"},null,null,"14.a. Constructed Wetland #1",null,"14.a. Constructed Wetland #1"]
["15.b. Wet Pond #1 (Coastal Plain)",null,"14.b. Constructed Wetland #2",null,{"$f":"P170","v":"14.b. Constructed Wetland #2"},null,{"$f":"P169","v":"14.a. Constructed Wetland #1"},null,null,"14.b. Constructed Wetland #2",null,"14.b. Constructed Wetland #2"]
["15.c. Wet Pond #2",null,"15.a. Wet Pond #1",null,"15.a. Wet Pond #1",null,{"$f":"P171","v":"15.a. Wet Pond #1"},null,null,{"$f":"P173","v":"15.c. Wet Pond #2"},null,{"$f":"P174","v":"15.d. Wet Pond #2 (Coastal Plain)"}]
["15.d. Wet Pond #2 (Coastal Plain)",null,"15.b. Wet Pond #1 (Coastal Plain)",null,"15.b. Wet Pond #1 (Coastal Plain)",null,"15.b. Wet Pond #1 (Coastal Plain)",null,null,{"$f":"P175","v":"16.a. MTD - Hydrodynamic"},null,{"$f":"P175","v":"16.a. MTD - Hydrodynamic"}]
["16.a. MTD - Hydrodynamic",null,"15.c. Wet Pond #2",null,"15.c. Wet Pond #2",null,"15.c. Wet Pond #2",null,null,{"$f":"P176","v":"16.b. MTD - Filtering"},null,{"$f":"P176","v":"16.b. MTD - Filtering"}]
["16.b. MTD - Filtering",null,"15.d. Wet Pond #2 (Coastal Plain)",null,"15.d. Wet Pond #2 (Coastal Plain)",null,"15.d. Wet Pond #2 (Coastal Plain)",null,null,{"$f":"P177","v":"16.c. MTD - Generic"},null,{"$f":"P177","v":"16.c. MTD - Generic"}]
["16.c. MTD - Generic",null,"16.a. MTD - Hydrodynamic",null,"16.a. MTD - Hydrodynamic",null,"16.a. MTD - Hydrodynamic"]
[null,null,"16.b. MTD - Filtering",null,"16.b. MTD - Filtering",null,"16.b. MTD - Filtering"]
[null,null,"16.c. MTD - Generic",null,"16.c. MTD - Generic",null,"16.c. MTD - Generic"]
[]
[]
[]
["Options for 13.c.  Wet Pond #2",null,"Options for 13.d.  Wet Pond #2 (Coastal Plain)",null,"Options for 14.a.  Manufactured Device-Hydrodynamic",null,"Options for 14.b.  Manufactured Device-Filtering",null,null,null,"Options for 14.c.  Manufactured Device-Generic"]
[]
[{"$f":"P135","v":"None"},null,{"$f":"P135","v":"None"},null,{"$f":"P135","v":"None"},null,{"$f":"P135","v":"None"},null,null,null,{"$f":"P135","v":"None"}]
[{"$f":"P146","v":"4.a. Grass Channel A/B Soils"},null,{"$f":"P146","v":"4.a. Grass Channel A/B Soils"},null,{"$f":"P146","v":"4.a. Grass Channel A/B Soils"},null,{"$f":"P146","v":"4.a. Grass Channel A/B Soils"},null,null,null,{"$f":"P146","v":"4.a. Grass Channel A/B Soils"}]
["4.b. Grass Channel C/D Soils",null,"4.b. Grass Channel C/D Soils",null,"4.b. Grass Channel C/D Soils",null,"4.b. Grass Channel C/D Soils",null,null,null,"4.b. Grass Channel C/D Soils"]
["4.c. Grass Channel Compost Amended Soils",null,"4.c. Grass Channel Compost Amended Soils",null,"4.c. Grass Channel Compost Amended Soils",null,"4.c. Grass Channel Compost Amended Soils",null,null,null,"4.c. Grass Channel Compost Amended Soils"]
["5.a. Dry Swale #1",null,"5.a. Dry Swale #1",null,"5.a. Dry Swale #1",null,"5.a. Dry Swale #1",null,null,null,"5.a. Dry Swale #1"]
["5.b. Dry Swale #2",null,"5.b. Dry Swale #2",null,"5.b. Dry Swale #2",null,"5.b. Dry Swale #2",null,null,null,"5.b. Dry Swale #2"]
["6.a. Bioretention #1",null,"6.a. Bioretention #1",null,"6.a. Bioretention #1",null,"6.a. Bioretention #1",null,null,null,"6.a. Bioretention #1"]
["6.b. Bioretention #2",null,"6.b. Bioretention #2",null,"6.b. Bioretention #2",null,"6.b. Bioretention #2",null,null,null,"6.b. Bioretention #2"]
["7.a. Infiltration #1",null,"7.a. Infiltration #1",null,"7.a. Infiltration #1",null,"7.a. Infiltration #1",null,null,null,"7.a. Infiltration #1"]
["7.b. Infiltration #2",null,"7.b. Infiltration #2",null,"7.b. Infiltration #2",null,"7.b. Infiltration #2",null,null,null,"7.b. Infiltration #2"]
["8.a. ED #1",null,"8.a. ED #1",null,"8.a. ED #1",null,"8.a. ED #1",null,null,null,"8.a. ED #1"]
["8.b. ED #2",null,"8.b. ED #2",null,"8.b. ED #2",null,"8.b. ED #2",null,null,null,"8.b. ED #2"]
["9.a. Sheetflow to A/B Soil Conservation Area ",null,"9.a. Sheetflow to A/B Soil Conservation Area ",null,"9.a. Sheetflow to A/B Soil Conservation Area ",null,"9.a. Sheetflow to A/B Soil Conservation Area ",null,null,null,"9.a. Sheetflow to A/B Soil Conservation Area "]
["9.b. Sheetflow to C/D Soil Conservation Area",null,"9.b. Sheetflow to C/D Soil Conservation Area",null,"9.b. Sheetflow to C/D Soil Conservation Area",null,"9.b. Sheetflow to C/D Soil Conservation Area",null,null,null,"9.b. Sheetflow to C/D Soil Conservation Area"]
["9.c. Sheetflow to Vegetated Filter Strip",null,"9.c. Sheetflow to Vegetated Filter Strip",null,"9.c. Sheetflow to Vegetated Filter Strip",null,"9.c. Sheetflow to Vegetated Filter Strip",null,null,null,"9.c. Sheetflow to Vegetated Filter Strip"]
["10.a. Regenerative Stormwater Conveyance #1",null,"10.a. Regenerative Stormwater Conveyance #1",null,"10.a. Regenerative Stormwater Conveyance #1",null,"10.a. Regenerative Stormwater Conveyance #1",null,null,null,"10.a. Regenerative Stormwater Conveyance #1"]
["10.b. Regenerative Stormwater Conveyance #2",null,"10.b. Regenerative Stormwater Conveyance #2",null,"10.b. Regenerative Stormwater Conveyance #2",null,"10.b. Regenerative Stormwater Conveyance #2",null,null,null,"10.b. Regenerative Stormwater Conveyance #2"]
[{"$f":"P165","v":"12.a. Wet Swale #1"},null,{"$f":"P165","v":"12.a. Wet Swale #1"},null,{"$f":"P165","v":"12.a. Wet Swale #1"},null,{"$f":"P165","v":"12.a. Wet Swale #1"},null,null,null,{"$f":"P165","v":"12.a. Wet Swale #1"}]
["12.b. Wet Swale #2",null,"12.b. Wet Swale #2",null,"12.b. Wet Swale #2",null,"12.b. Wet Swale #2",null,null,null,"12.b. Wet Swale #2"]
["13.a. Filtering Practice #1",null,"13.a. Filtering Practice #1",null,"13.a. Filtering Practice #1",null,"13.a. Filtering Practice #1",null,null,null,"13.a. Filtering Practice #1"]
["13.b. Filtering Practice #2",null,"13.b. Filtering Practice #2",null,"13.b. Filtering Practice #2",null,"13.b. Filtering Practice #2",null,null,null,"13.b. Filtering Practice #2"]
["14.a. Constructed Wetland #1",null,"14.a. Constructed Wetland #1",null,"14.a. Constructed Wetland #1",null,"14.a. Constructed Wetland #1",null,null,null,"14.a. Constructed Wetland #1"]
["14.b. Constructed Wetland #2",null,"14.b. Constructed Wetland #2",null,"14.b. Constructed Wetland #2",null,"14.b. Constructed Wetland #2",null,null,null,"14.b. Constructed Wetland #2"]
["15.a. Wet Pond #1",null,{"$f":"P172","v":"15.b. Wet Pond #1 (Coastal Plain)"},null,"15.a. Wet Pond #1",null,"15.a. Wet Pond #1",null,null,null,"15.a. Wet Pond #1"]
[{"$f":"P175","v":"16.a. MTD - Hydrodynamic"},null,{"$f":"P175","v":"16.a. MTD - Hydrodynamic"},null,"15.b. Wet Pond #1 (Coastal Plain)",null,"15.b. Wet Pond #1 (Coastal Plain)",null,null,null,"15.b. Wet Pond #1 (Coastal Plain)"]
[{"$f":"P176","v":"16.b. MTD - Filtering"},null,{"$f":"P176","v":"16.b. MTD - Filtering"},null,"15.c. Wet Pond #2",null,"15.c. Wet Pond #2",null,null,null,"15.c. Wet Pond #2"]
[{"$f":"P177","v":"16.c. MTD - Generic"},null,{"$f":"P177","v":"16.c. MTD - Generic"},null,"15.d. Wet Pond #2 (Coastal Plain)",null,"15.d. Wet Pond #2 (Coastal Plain)",null,null,null,"15.d. Wet Pond #2 (Coastal Plain)"]
[null,null,null,null,{"$f":"P176","v":"16.b. MTD - Filtering"}]
[]
[]
[]
["Options for 10.a. Regenerative Stormwater Conveyance #1",null,"Options for 10.b. Regenerative Stormwater Conveyance #1",null,null,null,"Options for 11.a. Trees over Pervious, A/B",null,null,null,"Options for 11.b. Trees over Pervious, C/D",null,null,"Options for 11.c. Trees over Impervious"]
[]
[{"$f":"P135","v":"None"},null,{"$f":"P135","v":"None"},null,null,null,{"$f":"P135","v":"None"},null,null,null,{"$f":"P135","v":"None"},null,null,{"$f":"P135","v":"None"}]
[null,null,null,null,null,null,{"$f":"P146","v":"4.a. Grass Channel A/B Soils"},null,null,null,{"$f":"P146","v":"4.a. Grass Channel A/B Soils"},null,null,{"$f":"P146","v":"4.a. Grass Channel A/B Soils"}]
[null,null,null,null,null,null,{"$f":"P147","v":"4.b. Grass Channel C/D Soils"},null,null,null,{"$f":"P147","v":"4.b. Grass Channel C/D Soils"},null,null,{"$f":"P147","v":"4.b. Grass Channel C/D Soils"}]
[null,null,null,null,null,null,{"$f":"P148","v":"4.c. Grass Channel Compost Amended Soils"},null,null,null,{"$f":"P148","v":"4.c. Grass Channel Compost Amended Soils"},null,null,"4.c. Grass Channel Compost Amended Soils"]
[null,null,null,null,null,null,"5.a. Dry Swale #1",null,null,null,"5.a. Dry Swale #1",null,null,"5.a. Dry Swale #1"]
[null,null,null,null,null,null,"5.b. Dry Swale #2",null,null,null,"5.b. Dry Swale #2",null,null,"5.b. Dry Swale #2"]
[null,null,null,null,null,null,"6.a. Bioretention #1",null,null,null,"6.a. Bioretention #1",null,null,"6.a. Bioretention #1"]
[null,null,null,null,null,null,"6.b. Bioretention #2",null,null,null,"6.b. Bioretention #2",null,null,"6.b. Bioretention #2"]
[null,null,null,null,null,null,"7.a. Infiltration #1",null,null,null,"7.a. Infiltration #1",null,null,"7.a. Infiltration #1"]
[null,null,null,null,null,null,"7.b. Infiltration #2",null,null,null,"7.b. Infiltration #2",null,null,"7.b. Infiltration #2"]
[null,null,null,null,null,null,"8.a. ED #1",null,null,null,"8.a. ED #1",null,null,"8.a. ED #1"]
[null,null,null,null,null,null,"8.b. ED #2",null,null,null,"8.b. ED #2",null,null,"8.b. ED #2"]
[null,null,null,null,null,null,"9.a. Sheetflow to A/B Soil Conservation Area ",null,null,null,"9.a. Sheetflow to A/B Soil Conservation Area ",null,null,"9.a. Sheetflow to A/B Soil Conservation Area "]
[null,null,null,null,null,null,"9.b. Sheetflow to C/D Soil Conservation Area",null,null,null,"9.b. Sheetflow to C/D Soil Conservation Area",null,null,"9.b. Sheetflow to C/D Soil Conservation Area"]
[null,null,null,null,null,null,"9.c. Sheetflow to Vegetated Filter Strip",null,null,null,"9.c. Sheetflow to Vegetated Filter Strip",null,null,"9.c. Sheetflow to Vegetated Filter Strip"]
[null,null,null,null,null,null,"10.a. Regenerative Stormwater Conveyance #1",null,null,null,"10.a. Regenerative Stormwater Conveyance #1",null,null,"10.a. Regenerative Stormwater Conveyance #1"]
[null,null,null,null,null,null,"10.b. Regenerative Stormwater Conveyance #2",null,null,null,"10.b. Regenerative Stormwater Conveyance #2",null,null,"10.b. Regenerative Stormwater Conveyance #2"]
[null,null,null,null,null,null,{"$f":"P165","v":"12.a. Wet Swale #1"},null,null,null,{"$f":"P165","v":"12.a. Wet Swale #1"},null,null,{"$f":"P165","v":"12.a. Wet Swale #1"}]
[null,null,null,null,null,null,{"$f":"P166","v":"12.b. Wet Swale #2"},null,null,null,{"$f":"P166","v":"12.b. Wet Swale #2"},null,null,{"$f":"P166","v":"12.b. Wet Swale #2"}]
[null,null,null,null,null,null,{"$f":"P167","v":"13.a. Filtering Practice #1"},null,null,null,{"$f":"P167","v":"13.a. Filtering Practice #1"},null,null,"13.a. Filtering Practice #1"]
[null,null,null,null,null,null,"13.b. Filtering Practice #2",null,null,null,"13.b. Filtering Practice #2",null,null,"13.b. Filtering Practice #2"]
[null,null,null,null,null,null,"14.a. Constructed Wetland #1",null,null,null,"14.a. Constructed Wetland #1",null,null,"14.a. Constructed Wetland #1"]
[null,null,null,null,null,null,"14.b. Constructed Wetland #2",null,null,null,"14.b. Constructed Wetland #2",null,null,"14.b. Constructed Wetland #2"]
[null,null,null,null,null,null,"15.a. Wet Pond #1",null,null,null,"15.a. Wet Pond #1",null,null,"15.a. Wet Pond #1"]
[null,null,null,null,null,null,"15.b. Wet Pond #1 (Coastal Plain)",null,null,null,"15.b. Wet Pond #1 (Coastal Plain)",null,null,"15.b. Wet Pond #1 (Coastal Plain)"]
[null,null,null,null,null,null,"15.c. Wet Pond #2",null,null,null,"15.c. Wet Pond #2",null,null,"15.c. Wet Pond #2"]
[null,null,null,null,null,null,"15.d. Wet Pond #2 (Coastal Plain)",null,null,null,"15.d. Wet Pond #2 (Coastal Plain)",null,null,"15.d. Wet Pond #2 (Coastal Plain)"]
[null,null,null,null,null,null,"16.a. MTD - Hydrodynamic",null,null,null,"16.a. MTD - Hydrodynamic",null,null,"16.a. MTD - Hydrodynamic"]
[null,null,null,null,null,null,"16.b. MTD - Filtering",null,null,null,"16.b. MTD - Filtering",null,null,"16.b. MTD - Filtering"]
[null,null,null,null,null,null,"16.c. MTD - Generic",null,null,null,"16.c. MTD - Generic",null,null,"16.c. MTD - Generic"]

{"sheet":"D.A. E","index":7,"n_rows":340,"n_cols":24,"rows_kept":340,"cut":false,"hidden":false,"merged":[[64,14,64,15],[100,14,100,15],[101,14,101,15],[102,14,102,15],[91,14,91,15],[94,14,94,15],[95,14,95,15],[96,14,96,15],[97,14,97,15],[99,0,99,1],[80,16,80,17],[82,14,82,15],[83,14,83,15],[86,14,86,15],[87,14,87,15],[90,14,90,15],[80,1,80,2],[55,14,55,15],[58,14,58,15],[59,14,59,15],[62,14,62,15],[63,14,63,15],[54,14,54,15],[33,14,33,15],[34,14,34,15],[37,14,37,15],[38,14,38,15],[41,14,41,15],[42,14,42,15],[45,14,45,15],[46,14,46,15],[49,14,49,15],[50,14,50,15],[53,14,53,15],[32,14,32,15],[17,14,17,15],[18,14,18,15],[19,14,19,15],[20,14,20,15],[21,14,21,15],[22,14,22,15],[23,14,23,15],[24,14,24,15],[25,14,25,15],[28,14,28,15],[29,14,29,15],[14,14,14,15],[0,3,0,4],[7,9,7,12],[8,9,8,12],[11,14,11,15],[13,14,13,15],[10,14,10,15]]}
["Drainage Area E",null,null,null,null,null,null,null,null,null,null,null,null,"VRRM 4.1, 2024"]
[]
["Drainage Area E Land Cover  (acres)"]
[null,"A Soils","B Soils","C Soils","D Soils","Totals","Land Cover Rv","Composite Loading P",null,null,null,null,null,null,null,null,null,"Composite Loading N"]
["Forest (acres)",null,null,null,null,{"$f":"SUMIF(B5:E5,\">=0\")","v":0},{"$f":"IF(F5>0,(B5*Constants!$B$7+C5*Constants!$C$7+D5*Constants!$D$7+E5*Constants!$E$7)/F5,0)","v":0},{"$f":"IF(G5>0,(B5*Constants!$B14/F5)+(C5*Constants!$C14/F5)+(D5*Constants!$D14/F5)+(E5*Constants!$E14/F5),0)","v":0},null,null,null,null,null,null,null,null,null,{"$f":"IF(G5>0,(B5*Constants!$B21/F5)+(C5*Constants!$C21/F5)+(D5*Constants!$D21/F5)+(E5*Constants!$E21/F5),0)","v":0}]
["Mixed Open (acres)",null,null,null,null,{"$f":"SUMIF(B6:E6,\">=0\")","v":0},{"$f":"IF(F6>0,(B6*Constants!$B$8+C6*Constants!$C$8+D6*Constants!$D$8+E6*Constants!$E$8)/F6,0)","v":0},{"$f":"IF(G6>0,(B6*Constants!$B15/F6)+(C6*Constants!$C15/F6)+(D6*Constants!$D15/F6)+(E6*Constants!$E15/F6),0)","v":0},null,null,null,null,null,null,null,null,null,{"$f":"IF(G6>0,(B6*Constants!$B22/F6)+(C6*Constants!$C22/F6)+(D6*Constants!$D22/F6)+(E6*Constants!$E22/F6),0)","v":0}]
["Managed Turf (acres)",null,null,null,null,{"$f":"SUMIF(B7:E7,\">=0\")","v":0},{"$f":"IF(F7>0,(B7*Constants!$B$9+C7*Constants!$C$9+D7*Constants!$D$9+E7*Constants!$E$9)/F7,0)","v":0},{"$f":"IF(G7>0,(B7*Constants!$B16/F7)+(C7*Constants!$C16/F7)+(D7*Constants!$D16/F7)+(E7*Constants!$E16/F7),0)","v":0},null,null,null,null,null,null,null,null,null,{"$f":"IF(G7>0,(B7*Constants!$B23/F7)+(C7*Constants!$C23/F7)+(D7*Constants!$D23/F7)+(E7*Constants!$E23/F7),0)","v":0}]
["Impervious Cover (acres) ",null,null,null,null,{"$f":"SUMIF(B8:E8,\">=0\")","v":0},{"$f":"IF(F8>0,(B8*Constants!$B$10+C8*Constants!$C$10+D8*Constants!$D$10+E8*Constants!$E$10)/F8,0)","v":0},{"$f":"IF(G8>0,(B8*Constants!$B17/F8)+(C8*Constants!$C17/F8)+(D8*Constants!$D17/F8)+(E8*Constants!$E17/F8),0)","v":0},null,"     Total Phosphorus Available for Removal in D.A. E (lb/yr)",null,null,null,{"$f":"SUMPRODUCT(B6:E8,Constants!B15:E17)","v":0},null,null,null,{"$f":"IF(G8>0,(B8*Constants!$B24/F8)+(C8*Constants!$C24/F8)+(D8*Constants!$D24/F8)+(E8*Constants!$E24/F8),0)","v":0}]
[null,null,null,null,"Total",{"$f":"SUM(F5:F8)","v":0},null,null,null,"Post Development Treatment Volume in D.A. E (ft3)",null,null,null,{"$f":"IFERROR(Constants!$B$2/12*(F7*G7+F8*G8+F6*G6)/(F7+F8+F6)*(F7+F8+F6)*43560,0)","v":0}]
[]
["Stormwater Best Management Practices (RR = Runoff Reduction)",null,null,null,null,null,null,null,null,null,null,null,null,null,"--Select from dropdown lists--"]
["Practice","Runoff Reduction Credit (%)","Mixed Open Credit Area (acres) ","Managed Turf Credit Area (acres) ","Impervious Cover Credit Area (acres)","Volume from Upstream Practice (ft3)","Runoff Reduction (ft3)","Remaining Runoff Volume  (ft3)","Total BMP Treatment Volume (ft3)","Phosphorus Removal Efficiency (%)","Phosphorus Load from Upstream Practices (lb)","Untreated Phosphorus Load to Practice (lb)","Phosphorus Removed By Practice (lb)","Remaining Phosphorus Load (lb)","Downstream Practice to be Employed",null,null,"Nitrogen Removal Efficiency (%)","Nitrogen Load from Upstream  Practices (lbs)","Untreated Nitrogen Load to Practice (lbs)","Nitrogen Removed By Practice (lbs)","Remaining Nitrogen Load (lbs)"]
["1. Vegetated Roof (RR)",null,null,null,null,null,null,null,null,null,null,null,null,null,null,null,null,"1. Vegetated Roof (RR)"]
["1.a. Vegetated Roof #1 (P-FIL-02)",{"$f":"Constants!$B28","v":45},null,null,null,null,{"$f":"(Constants!$B$2*($G$8*$E14)*3630)*$B14/100","v":0},{"$f":"(Constants!$B$2*($G$8*$E14)*3630)*(1-$B14/100)","v":0},{"$f":"+$G14+$H14","v":0},{"$f":"Constants!C28","v":0},null,{"$f":"E14*$H$8","v":0},{"$f":"IFERROR($L14*($G14+$H14*$J14/100)/($I14),0)","v":0},{"$f":"$L14-$M14","v":0},null,null,null,{"$f":"Constants!$D28","v":0},null,{"$f":"E14*$R$8","v":0},{"$f":"IFERROR($T14*($G14+$H14*$R14/100)/$I14,0)","v":0},{"$f":"$T14-$U14","v":0}]
["1.b. Vegetated Roof #2 (P-FIL-02)",{"$f":"Constants!$B29","v":60},null,null,null,null,{"$f":"(Constants!$B$2*($G$8*$E15)*3630)*$B15/100","v":0},{"$f":"(Constants!$B$2*($G$8*$E15)*3630)*(1-$B15/100)","v":0},{"$f":"+$G15+$H15","v":0},{"$f":"Constants!C29","v":0},null,{"$f":"E15*$H$8","v":0},{"$f":"IFERROR($L15*($G15+$H15*$J15/100)/($I15),0)","v":0},{"$f":"$L15-$M15","v":0},null,null,null,{"$f":"Constants!$D29","v":0},null,{"$f":"E15*$R$8","v":0},{"$f":"IFERROR($T15*($G15+$H15*$R15/100)/$I15,0)","v":0},{"$f":"$T15-$U15","v":0}]
[]
["2. Rooftop Disconnection (RR)",null,null,null,null,null,null,null,null,null,null,null,null,null,null,null,null,"2. Rooftop Disconnection (RR)"]
["2.a. Simple Disconnection to A/B Soils \n(P-FIL-01)",{"$f":"Constants!$B32","v":50},null,null,null,{"$f":"SUMIF($O$14:$O$103,P136,$H$14:$H$103)","v":0},{"$f":"(Constants!$B$2*($G$8*$E18)*3630)*$B18/100","v":0},{"$f":"(Constants!$B$2*($G$8*$E18)*3630)*(1-$B18/100)","v":0},{"$f":"+$G18+$H18","v":0},{"$f":"Constants!C32","v":0},{"$f":"SUMIF($O$13:$O$103,P136,$N$13:$N$103)","v":0},{"$f":"E18*$H$8","v":0},{"$f":"IFERROR(($K18+$L18)*($G18+$H18*$J18/100)/$I18,0)","v":0},{"$f":"$K18+$L18-$M18","v":0},null,null,null,{"$f":"Constants!$D32","v":0},{"$f":"SUMIF($O$14:$O$103,$P136,$V$14:$V$103)","v":0},{"$f":"E18*$R$8","v":0},{"$f":"IFERROR(($S18+$T18)*($G18+$H18*$R18/100)/$I18,0)","v":0},{"$f":"$S18+$T18-$U18","v":0}]
["2.b. Simple Disconnection to C/D Soils \n(P-FIL-01)",{"$f":"Constants!$B33","v":25},null,null,null,0,{"$f":"(Constants!$B$2*($G$8*$E19)*3630)*$B19/100","v":0},{"$f":"(Constants!$B$2*($G$8*$E19)*3630)*(1-$B19/100)","v":0},{"$f":"+$G19+$H19","v":0},{"$f":"Constants!C33","v":0},0,{"$f":"E19*$H$8","v":0},{"$f":"IFERROR(($K19+$L19)*($G19+$H19*$J19/100)/$I19,0)","v":0},{"$f":"$K19+$L19-$M19","v":0},null,null,null,{"$f":"Constants!$D33","v":0},0,0,{"$f":"IFERROR(($S19+$T19)*($G19+$H19*$R19/100)/$I19,0)","v":0},{"$f":"$S19+$T19-$U19","v":0}]
["2.c. To Soil Amended Filter Path as per specifications (existing C/D soils) (P-FIL-08)",{"$f":"Constants!$B34","v":50},null,null,null,0,{"$f":"(Constants!$B$2*($G$8*$E20)*3630)*$B20/100","v":0},{"$f":"(Constants!$B$2*($G$8*$E20)*3630)*(1-$B20/100)","v":0},0,{"$f":"Constants!C34","v":0},0,{"$f":"E20*$H$8","v":0},0,0,null,null,null,{"$f":"Constants!$D34","v":0},0,0,0,0]
["2.d. To Dry Well or French Drain #1, \nMicro-Infilration #1 (P-FIL-04)",{"$f":"Constants!$B35","v":50},null,null,null,0,{"$f":"(Constants!$B$2*($G$8*$E21)*3630)*$B21/100","v":0},{"$f":"(Constants!$B$2*($G$8*$E21)*3630)*(1-$B21/100)","v":0},0,{"$f":"Constants!C35","v":25},0,0,0,{"$f":"$K21+$L21-$M21","v":0},null,null,null,{"$f":"Constants!$D35","v":15},0,0,0,0]
["2.e. To Dry Well or French Drain #2, \nMicro-Infiltration #2 (P-FIL-04)",{"$f":"Constants!$B36","v":90},null,null,null,0,{"$f":"(Constants!$B$2*($G$8*$E22)*3630)*$B22/100","v":0},{"$f":"(Constants!$B$2*($G$8*$E22)*3630)*(1-$B22/100)","v":0},0,{"$f":"Constants!C36","v":25},0,0,0,0,null,null,null,{"$f":"Constants!$D36","v":15},0,0,0,0]
["2.f. To Rain Garden #1, \nMicro-Bioretention #1 (P-FIL-05)",{"$f":"Constants!$B37","v":40},null,null,null,0,{"$f":"(Constants!$B$2*($G$8*$E23)*3630)*$B23/100","v":0},{"$f":"(Constants!$B$2*($G$8*$E23)*3630)*(1-$B23/100)","v":0},0,{"$f":"Constants!C37","v":25},0,0,0,0,null,null,null,{"$f":"Constants!$D37","v":40},0,0,0,0]
["2.g. To Rain Garden #2, \nMicro-Bioretention #2 (P-FIL-05)",{"$f":"Constants!$B38","v":80},null,null,null,0,{"$f":"(Constants!$B$2*($G$8*$E24)*3630)*$B24/100","v":0},{"$f":"(Constants!$B$2*($G$8*$E24)*3630)*(1-$B24/100)","v":0},{"$f":"+$G24+$H24","v":0},{"$f":"Constants!C38","v":50},0,0,0,0,null,null,null,{"$f":"Constants!$D38","v":60},0,0,0,0]
["2.h. To Rainwater Harvesting (P-BAS-04)",0,null,null,null,0,{"$f":"(Constants!$B$2*($G$8*$E25)*3630)*$B25/100","v":0},{"$f":"(Constants!$B$2*($G$8*$E25)*3630)*(1-$B25/100)","v":0},0,{"$f":"Constants!C39","v":0},0,0,0,0,null,null,null,{"$f":"Constants!$D39","v":0},0,0,0,0]
["2.i. To Stormwater Planter, \nUrban Bioretention (P-FIL-05)",{"$f":"Constants!$B40","v":40},null,null,null,0,{"$f":"(Constants!$B$2*($G$8*$E26)*3630)*$B26/100","v":0},{"$f":"(Constants!$B$2*($G$8*$E26)*3630)*(1-$B26/100)","v":0},0,{"$f":"Constants!C40","v":25},0,0,{"$f":"IFERROR(($K26+$L26)*($G26+$H26*$J26/100)/$I26,0)","v":0},0,null,null,null,{"$f":"Constants!$D40","v":40},0,0,0,0]
[]
["3. Permeable Pavement  (RR)",null,null,null,null,null,null,null,null,null,null,null,null,null,null,null,null,"3. Permeable Pavement  (RR)"]
["3.a. Permeable Pavement #1 (P-FIL-03)",{"$f":"Constants!$B43","v":45},null,null,null,{"$f":"SUMIF($O$14:$O$103,P145,$H$14:$H$103)","v":0},{"$f":"(Constants!$B$2*($G$8*$E29)*3630)*$B29/100","v":0},{"$f":"(Constants!$B$2*($G$8*$E29)*3630)*(1-$B29/100)","v":0},{"$f":"+$G29+$H29","v":0},{"$f":"Constants!C43","v":25},{"$f":"SUMIF($O$13:$O$103,P145,$N$13:$N$103)","v":0},{"$f":"E29*$H$8","v":0},{"$f":"IFERROR(($K29+$L29)*($G29+$H29*$J29/100)/$I29,0)","v":0},{"$f":"$K29+$L29-$M29","v":0},null,null,null,{"$f":"Constants!$D43","v":25},{"$f":"SUMIF($O$14:$O$103,$P145,$V$14:$V$103)","v":0},{"$f":"E29*$R$8","v":0},{"$f":"IFERROR(($S29+$T29)*($G29+$H29*$R29/100)/$I29,0)","v":0},{"$f":"$S29+$T29-$U29","v":0}]
["3.b. Permeable Pavement #2 (P-FIL-03)",{"$f":"Constants!$B44","v":75},null,null,null,null,{"$f":"(Constants!$B$2*($G$8*$E30)*3630)*$B30/100","v":0},{"$f":"(Constants!$B$2*($G$8*$E30)*3630)*(1-$B30/100)","v":0},{"$f":"+$G30+$H30","v":0},{"$f":"Constants!C44","v":25},null,{"$f":"E30*$H$8","v":0},{"$f":"IFERROR(($K30+$L30)*($G30+$H30*$J30/100)/$I30,0)","v":0},{"$f":"$L30-$M30","v":0},null,null,null,{"$f":"Constants!$D44","v":25},null,{"$f":"E30*$R$8","v":0},{"$f":"IFERROR(($S30+$T30)*($G30+$H30*$R30/100)/$I30,0)","v":0},{"$f":"$S30+$T30-$U30","v":0}]
[]
["4. Grass Channel (RR)",null,null,null,null,null,null,null,null,null,null,null,null,null,null,null,null,"4. Grass Channel (RR)"]
["4.a. Grass Channel A/B Soils (P-CNV-01)",{"$f":"Constants!$B47","v":20},null,null,null,{"$f":"SUMIF($O$14:$O$103,P146,$H$14:$H$103)","v":0},{"$f":"(Constants!$B$2*($G$7*$D33+$G$8*$E33+$C33*$G$6)*3630+$F33)*$B33/100","v":0},{"$f":"(Constants!$B$2*($G$7*$D33+$G$8*$E33+$C33*$G$6)*3630+$F33)*(1-$B33/100)","v":0},{"$f":"+$G33+$H33","v":0},{"$f":"Constants!C47","v":15},{"$f":"SUMIF($O$13:$O$103,P146,$N$13:$N$103)","v":0},{"$f":"(D33*$H$7)+(C33*$H$6)+(E33*$H$8)","v":0},{"$f":"IFERROR(($K33+$L33)*($G33+$H33*$J33/100)/$I33,0)","v":0},{"$f":"$K33+$L33-$M33","v":0},null,null,null,{"$f":"Constants!$D47","v":20},{"$f":"SUMIF($O$14:$O$103,$P146,$V$14:$V$103)","v":0},{"$f":"(D33*$R$7)+(C33*$R$6)+(E33*$R$8)","v":0},{"$f":"IFERROR(($S33+$T33)*($G33+$H33*$R33/100)/$I33,0)","v":0},{"$f":"$S33+$T33-$U33","v":0}]
["4.b. Grass Channel C/D Soils (P-CNV-01)",{"$f":"Constants!$B48","v":10},null,null,null,{"$f":"SUMIF($O$14:$O$103,P147,$H$14:$H$103)","v":0},{"$f":"(Constants!$B$2*($G$7*$D34+$G$8*$E34+$C34*$G$6)*3630+$F34)*$B34/100","v":0},{"$f":"(Constants!$B$2*($G$7*$D34+$G$8*$E34+$C34*$G$6)*3630+$F34)*(1-$B34/100)","v":0},{"$f":"+$G34+$H34","v":0},{"$f":"Constants!C48","v":15},{"$f":"SUMIF($O$13:$O$103,P147,$N$13:$N$103)","v":0},{"$f":"(D34*$H$7)+(C34*$H$6)+(E34*$H$8)","v":0},{"$f":"IFERROR(($K34+$L34)*($G34+$H34*$J34/100)/$I34,0)","v":0},{"$f":"$K34+$L34-$M34","v":0},null,null,null,{"$f":"Constants!$D48","v":20},{"$f":"SUMIF($O$14:$O$103,$P147,$V$14:$V$103)","v":0},{"$f":"(D34*$R$7)+(C34*$R$6)+(E34*$R$8)","v":0},{"$f":"IFERROR(($S34+$T34)*($G34+$H34*$R34/100)/$I34,0)","v":0},{"$f":"$S34+$T34-$U34","v":0}]
["4.c. Grass Channel with Compost Amended Soils as per specs (P-FIL-08)",{"$f":"Constants!$B49","v":20},null,null,null,{"$f":"SUMIF($O$14:$O$103,P148,$H$14:$H$103)","v":0},{"$f":"(Constants!$B$2*($G$7*$D35+$G$8*$E35+$C35*$G$6)*3630+$F35)*$B35/100","v":0},{"$f":"(Constants!$B$2*($G$7*$D35+$G$8*$E35+$C35*$G$6)*3630+$F35)*(1-$B35/100)","v":0},{"$f":"+$G35+$H35","v":0},{"$f":"Constants!C49","v":15},{"$f":"SUMIF($O$13:$O$103,P148,$N$13:$N$103)","v":0},{"$f":"(D35*$H$7)+(C35*$H$6)+(E35*$H$8)","v":0},{"$f":"IFERROR(($K35+$L35)*($G35+$H35*$J35/100)/$I35,0)","v":0},{"$f":"$K35+$L35-$M35","v":0},null,null,null,{"$f":"Constants!$D49","v":20},{"$f":"SUMIF($O$14:$O$103,$P148,$V$14:$V$103)","v":0},{"$f":"(D35*$R$7)+(C35*$R$6)+(E35*$R$8)","v":0},{"$f":"IFERROR(($S35+$T35)*($G35+$H35*$R35/100)/$I35,0)","v":0},{"$f":"$S35+$T35-$U35","v":0}]
[null,null,null,null,null,null,null,null,null,null,null,null,null,null,null,null,null,null,null,null,null,null,null,"`"]
["5. Dry Swale (RR)",null,null,null,null,null,null,null,null,null,null,null,null,null,null,null,null,"5. Dry Swale (RR)"]
["5.a. Dry Swale #1 (P-CNV-02)",{"$f":"Constants!$B52","v":40},null,null,null,{"$f":"SUMIF($O$14:$O$103,P149,$H$14:$H$103)","v":0},{"$f":"(Constants!$B$2*($G$7*$D38+$G$8*$E38+$C38*$G$6)*3630+$F38)*$B38/100","v":0},{"$f":"(Constants!$B$2*($G$7*$D38+$G$8*$E38+$C38*$G$6)*3630+$F38)*(1-$B38/100)","v":0},{"$f":"+$G38+$H38","v":0},{"$f":"Constants!C52","v":20},{"$f":"SUMIF($O$13:$O$103,P149,$N$13:$N$103)","v":0},{"$f":"(D38*$H$7)+(C38*$H$6)+(E38*$H$8)","v":0},{"$f":"IFERROR(($K38+$L38)*($G38+$H38*$J38/100)/$I38,0)","v":0},{"$f":"$K38+$L38-$M38","v":0},null,null,null,{"$f":"Constants!$D52","v":25},{"$f":"SUMIF($O$14:$O$103,$P149,$V$14:$V$103)","v":0},{"$f":"(D38*$R$7)+(C38*$R$6)+(E38*$R$8)","v":0},{"$f":"IFERROR(($S38+$T38)*($G38+$H38*$R38/100)/$I38,0)","v":0},{"$f":"$S38+$T38-$U38","v":0}]
["5.b. Dry Swale #2 (P-CNV-02)",{"$f":"Constants!$B53","v":60},null,null,null,{"$f":"SUMIF($O$14:$O$103,P150,$H$14:$H$103)","v":0},{"$f":"(Constants!$B$2*($G$7*$D39+$G$8*$E39+$C39*$G$6)*3630+$F39)*$B39/100","v":0},{"$f":"(Constants!$B$2*($G$7*$D39+$G$8*$E39+$C39*$G$6)*3630+$F39)*(1-$B39/100)","v":0},{"$f":"+$G39+$H39","v":0},{"$f":"Constants!C53","v":40},{"$f":"SUMIF($O$13:$O$103,P150,$N$13:$N$103)","v":0},{"$f":"(D39*$H$7)+(C39*$H$6)+(E39*$H$8)","v":0},{"$f":"IFERROR(($K39+$L39)*($G39+$H39*$J39/100)/$I39,0)","v":0},{"$f":"$K39+$L39-$M39","v":0},null,null,null,{"$f":"Constants!$D53","v":35},{"$f":"SUMIF($O$14:$O$103,$P150,$V$14:$V$103)","v":0},{"$f":"(D39*$R$7)+(C39*$R$6)+(E39*$R$8)","v":0},{"$f":"IFERROR(($S39+$T39)*($G39+$H39*$R39/100)/$I39,0)","v":0},{"$f":"$S39+$T39-$U39","v":0}]
[]
["6. Bioretention (RR)",null,null,null,null,null,null,null,null,null,null,null,null,null,null,null,null,"6. Bioretention (RR)"]
["6.a. Bioretention #1 or Micro-Bioretention #1 or Urban Bioretention (P-FIL-05)",{"$f":"Constants!$B56","v":40},null,null,null,{"$f":"SUMIF($O$14:$O$103,P151,$H$14:$H$103)","v":0},{"$f":"(Constants!$B$2*($G$7*$D42+$G$8*$E42+$C42*$G$6)*3630+$F42)*$B42/100","v":0},{"$f":"(Constants!$B$2*($G$7*$D42+$G$8*$E42+$C42*$G$6)*3630+$F42)*(1-$B42/100)","v":0},{"$f":"+$G42+$H42","v":0},{"$f":"Constants!C56","v":25},{"$f":"SUMIF($O$13:$O$103,P151,$N$13:$N$103)","v":0},{"$f":"(D42*$H$7)+(C42*$H$6)+(E42*$H$8)","v":0},{"$f":"IFERROR(($K42+$L42)*($G42+$H42*$J42/100)/$I42,0)","v":0},{"$f":"$K42+$L42-$M42","v":0},null,null,null,{"$f":"Constants!$D56","v":40},{"$f":"SUMIF($O$14:$O$103,$P151,$V$14:$V$103)","v":0},{"$f":"(D42*$R$7)+(C42*$R$6)+(E42*$R$8)","v":0},{"$f":"IFERROR(($S42+$T42)*($G42+$H42*$R42/100)/$I42,0)","v":0},{"$f":"$S42+$T42-$U42","v":0}]
["6.b. Bioretention #2 or \nMicro-Bioretention #2 (P-FIL-05)",{"$f":"Constants!$B57","v":80},null,null,null,{"$f":"SUMIF($O$14:$O$103,P152,$H$14:$H$103)","v":0},{"$f":"(Constants!$B$2*($G$7*$D43+$G$8*$E43+$C43*$G$6)*3630+$F43)*$B43/100","v":0},{"$f":"(Constants!$B$2*($G$7*$D43+$G$8*$E43+$C43*$G$6)*3630+$F43)*(1-$B43/100)","v":0},{"$f":"+$G43+$H43","v":0},{"$f":"Constants!C57","v":50},{"$f":"SUMIF($O$13:$O$103,P152,$N$13:$N$103)","v":0},{"$f":"(D43*$H$7)+(C43*$H$6)+(E43*$H$8)","v":0},{"$f":"IFERROR(($K43+$L43)*($G43+$H43*$J43/100)/$I43,0)","v":0},{"$f":"$K43+$L43-$M43","v":0},null,null,null,{"$f":"Constants!$D57","v":60},{"$f":"SUMIF($O$14:$O$103,$P152,$V$14:$V$103)","v":0},{"$f":"(D43*$R$7)+(C43*$R$6)+(E43*$R$8)","v":0},{"$f":"IFERROR(($S43+$T43)*($G43+$H43*$R43/100)/$I43,0)","v":0},{"$f":"$S43+$T43-$U43","v":0}]
[]
["7. Infiltration (RR)",null,null,null,null,null,null,null,null,null,null,null,null,null,null,null,null,"7. Infiltration (RR)"]
["7.a. Infiltration #1 (P-FIL-04)",{"$f":"Constants!$B60","v":50},null,null,null,{"$f":"SUMIF($O$14:$O$103,P153,$H$14:$H$103)","v":0},{"$f":"(Constants!$B$2*($G$7*$D46+$G$8*$E46+$C46*$G$6)*3630+$F46)*$B46/100","v":0},{"$f":"(Constants!$B$2*($G$7*$D46+$G$8*$E46+$C46*$G$6)*3630+$F46)*(1-$B46/100)","v":0},{"$f":"+$G46+$H46","v":0},{"$f":"Constants!C60","v":25},{"$f":"SUMIF($O$13:$O$103,P153,$N$13:$N$103)","v":0},{"$f":"(D46*$H$7)+(C46*$H$6)+(E46*$H$8)","v":0},{"$f":"IFERROR(($K46+$L46)*($G46+$H46*$J46/100)/$I46,0)","v":0},{"$f":"$K46+$L46-$M46","v":0},null,null,null,{"$f":"Constants!$D60","v":15},{"$f":"SUMIF($O$14:$O$103,$P153,$V$14:$V$103)","v":0},{"$f":"(D46*$R$7)+(C46*$R$6)+(E46*$R$8)","v":0},{"$f":"IFERROR(($S46+$T46)*($G46+$H46*$R46/100)/$I46,0)","v":0},{"$f":"$S46+$T46-$U46","v":0}]
["7.b. Infiltration #2 (P-FIL-04)",{"$f":"Constants!$B61","v":90},null,null,null,{"$f":"SUMIF($O$14:$O$103,P154,$H$14:$H$103)","v":0},{"$f":"(Constants!$B$2*($G$7*$D47+$G$8*$E47+$C47*$G$6)*3630+$F47)*$B47/100","v":0},{"$f":"(Constants!$B$2*($G$7*$D47+$G$8*$E47+$C47*$G$6)*3630+$F47)*(1-$B47/100)","v":0},{"$f":"+$G47+$H47","v":0},{"$f":"Constants!C61","v":25},{"$f":"SUMIF($O$13:$O$103,P154,$N$13:$N$103)","v":0},{"$f":"(D47*$H$7)+(C47*$H$6)+(E47*$H$8)","v":0},{"$f":"IFERROR(($K47+$L47)*($G47+$H47*$J47/100)/$I47,0)","v":0},{"$f":"$K47+$L47-$M47","v":0},null,null,null,{"$f":"Constants!$D61","v":15},{"$f":"SUMIF($O$14:$O$103,$P154,$V$14:$V$103)","v":0},{"$f":"(D47*$R$7)+(C47*$R$6)+(E47*$R$8)","v":0},{"$f":"IFERROR(($S47+$T47)*($G47+$H47*$R47/100)/$I47,0)","v":0},{"$f":"$S47+$T47-$U47","v":0}]
[]
["8. Extended Detention Pond (RR)",null,null,null,null,null,null,null,null,null,null,null,null,null,null,null,null,"8. Extended Detention Pond (RR)"]
["8.a. ED #1 (P-BAS-03)",{"$f":"Constants!$B64","v":0},null,null,null,{"$f":"SUMIF($O$14:$O$103,P155,$H$14:$H$103)","v":0},{"$f":"(Constants!$B$2*($G$7*$D50+$G$8*$E50+$C50*$G$6)*3630+$F50)*$B50/100","v":0},{"$f":"(Constants!$B$2*($G$7*$D50+$G$8*$E50+$C50*$G$6)*3630+$F50)*(1-$B50/100)","v":0},{"$f":"+$G50+$H50","v":0},{"$f":"Constants!C64","v":15},{"$f":"SUMIF($O$13:$O$103,P155,$N$13:$N$103)","v":0},{"$f":"(D50*$H$7)+(C50*$H$6)+(E50*$H$8)","v":0},{"$f":"IFERROR(($K50+$L50)*($G50+$H50*$J50/100)/$I50,0)","v":0},{"$f":"$K50+$L50-$M50","v":0},null,null,null,{"$f":"Constants!$D64","v":10},{"$f":"SUMIF($O$14:$O$103,$P155,$V$14:$V$103)","v":0},{"$f":"(D50*$R$7)+(C50*$R$6)+(E50*$R$8)","v":0},{"$f":"IFERROR(($S50+$T50)*($G50+$H50*$R50/100)/$I50,0)","v":0},{"$f":"$S50+$T50-$U50","v":0}]
["8.b. ED #2 (P-BAS-03)",{"$f":"Constants!$B65","v":15},null,null,null,{"$f":"SUMIF($O$14:$O$103,P156,$H$14:$H$103)","v":0},{"$f":"(Constants!$B$2*($G$7*$D51+$G$8*$E51+$C51*$G$6)*3630+$F51)*$B51/100","v":0},{"$f":"(Constants!$B$2*($G$7*$D51+$G$8*$E51+$C51*$G$6)*3630+$F51)*(1-$B51/100)","v":0},{"$f":"+$G51+$H51","v":0},{"$f":"Constants!C65","v":15},{"$f":"SUMIF($O$13:$O$103,P156,$N$13:$N$103)","v":0},{"$f":"(D51*$H$7)+(C51*$H$6)+(E51*$H$8)","v":0},{"$f":"IFERROR(($K51+$L51)*($G51+$H51*$J51/100)/$I51,0)","v":0},{"$f":"$K51+$L51-$M51","v":0},null,null,null,{"$f":"Constants!$D65","v":10},{"$f":"SUMIF($O$14:$O$103,$P156,$V$14:$V$103)","v":0},{"$f":"(D51*$R$7)+(C51*$R$6)+(E51*$R$8)","v":0},{"$f":"IFERROR(($S51+$T51)*($G51+$H51*$R51/100)/$I51,0)","v":0},{"$f":"$S51+$T51-$U51","v":0}]
[]
["9. Sheetflow to Filter/Open Space (RR)",null,null,null,null,null,null,null,null,null,null,null,null,null,null,null,null,"9. Sheetflow to Filter/Open Space (RR)"]
["9.a. Sheetflow to Conservation Area, A/B Soils (P-FIL-07)",{"$f":"Constants!$B68","v":75},null,null,null,{"$f":"SUMIF($O$14:$O$103,P157,$H$14:$H$103)","v":0},{"$f":"(Constants!$B$2*($G$7*$D54+$G$8*$E54+$C54*$G$6)*3630+$F54)*$B54/100","v":0},{"$f":"(Constants!$B$2*($G$7*$D54+$G$8*$E54+$C54*$G$6)*3630+$F54)*(1-$B54/100)","v":0},{"$f":"+$G54+$H54","v":0},{"$f":"Constants!C68","v":0},{"$f":"SUMIF($O$13:$O$103,P157,$N$13:$N$103)","v":0},{"$f":"(D54*$H$7)+(C54*$H$6)+(E54*$H$8)","v":0},{"$f":"IFERROR(($K54+$L54)*($G54+$H54*$J54/100)/$I54,0)","v":0},{"$f":"$K54+$L54-$M54","v":0},null,null,null,{"$f":"Constants!$D68","v":0},{"$f":"SUMIF($O$14:$O$103,$P157,$V$14:$V$103)","v":0},{"$f":"(D54*$R$7)+(C54*$R$6)+(E54*$R$8)","v":0},{"$f":"IFERROR(($S54+$T54)*($G54+$H54*$R54/100)/$I54,0)","v":0},{"$f":"$S54+$T54-$U54","v":0}]
["9.b. Sheetflow to Conservation Area, C/D Soils (P-FIL-07)",{"$f":"Constants!$B69","v":50},null,null,null,{"$f":"SUMIF($O$14:$O$103,P158,$H$14:$H$103)","v":0},{"$f":"(Constants!$B$2*($G$7*$D55+$G$8*$E55+$C55*$G$6)*3630+$F55)*$B55/100","v":0},{"$f":"(Constants!$B$2*($G$7*$D55+$G$8*$E55+$C55*$G$6)*3630+$F55)*(1-$B55/100)","v":0},{"$f":"+$G55+$H55","v":0},{"$f":"Constants!C69","v":0},{"$f":"SUMIF($O$13:$O$103,P158,$N$13:$N$103)","v":0},{"$f":"(D55*$H$7)+(C55*$H$6)+(E55*$H$8)","v":0},{"$f":"IFERROR(($K55+$L55)*($G55+$H55*$J55/100)/$I55,0)","v":0},{"$f":"$K55+$L55-$M55","v":0},null,null,null,{"$f":"Constants!$D69","v":0},{"$f":"SUMIF($O$14:$O$103,$P158,$V$14:$V$103)","v":0},{"$f":"(D55*$R$7)+(C55*$R$6)+(E55*$R$8)","v":0},{"$f":"IFERROR(($S55+$T55)*($G55+$H55*$R55/100)/$I55,0)","v":0},{"$f":"$S55+$T55-$U55","v":0}]
["9.c. Sheetflow to Vegetated Filter Strip, A Soils or Compost Amended B/C/D Soils \n(Spec P-FIL-07 & P-FIL-08)",{"$f":"Constants!$B70","v":50},null,null,null,{"$f":"SUMIF($O$14:$O$103,P159,$H$14:$H$103)","v":0},{"$f":"(Constants!$B$2*($G$7*$D56+$G$8*$E56+$C56*$G$6)*3630+$F56)*$B56/100","v":0},{"$f":"(Constants!$B$2*($G$7*$D56+$G$8*$E56+$C56*$G$6)*3630+$F56)*(1-$B56/100)","v":0},{"$f":"+$G56+$H56","v":0},{"$f":"Constants!C70","v":0},{"$f":"SUMIF($O$13:$O$103,P159,$N$13:$N$103)","v":0},{"$f":"(D56*$H$7)+(C56*$H$6)+(E56*$H$8)","v":0},{"$f":"IFERROR(($K56+$L56)*($G56+$H56*$J56/100)/$I56,0)","v":0},{"$f":"$K56+$L56-$M56","v":0},null,null,null,{"$f":"Constants!$D70","v":0},{"$f":"SUMIF($O$14:$O$103,$P159,$V$14:$V$103)","v":0},{"$f":"(D56*$R$7)+(C56*$R$6)+(E56*$R$8)","v":0},{"$f":"IFERROR(($S56+$T56)*($G56+$H56*$R56/100)/$I56,0)","v":0},{"$f":"$S56+$T56-$U56","v":0}]
[]
["10. Regenerative Stormwater Conveyance",null,null,null,null,null,null,null,null,null,null,null,null,null,null,null,null,"10. Regenerative Stormwater Conveyance"]
["10.a. Regenerative Stormwater Conveyance (P-CNV-04)",{"$f":"Constants!$B73","v":0},null,null,null,{"$f":"SUMIF($O$14:$O$103,P160,$H$14:$H$103)","v":0},{"$f":"(Constants!$B$2*($G$7*$D59+$G$8*$E59+$C59*$G$6)*3630+$F59)*$B59/100","v":0},{"$f":"(Constants!$B$2*($G$7*$D59+$G$8*$E59+$C59*$G$6)*3630+$F59)*(1-$B59/100)","v":0},{"$f":"+$G59+$H59","v":0},{"$f":"Constants!C73","v":20},{"$f":"SUMIF($O$13:$O$103,P160,$N$13:$N$103)","v":0},{"$f":"(D59*$H$7)+(C59*$H$6)+(E59*$H$8)","v":0},{"$f":"IFERROR(($K59+$L59)*($G59+$H59*$J59/100)/$I59,0)","v":0},{"$f":"$K59+$L59-$M59","v":0},null,null,null,{"$f":"Constants!$D73","v":25},{"$f":"SUMIF($O$14:$O$103,$P160,$V$14:$V$103)","v":0},{"$f":"(D59*$R$7)+(C59*$R$6)+(E59*$R$8)","v":0},{"$f":"IFERROR(($S59+$T59)*($G59+$H59*$R59/100)/$I59,0)","v":0},{"$f":"$S59+$T59-$U59","v":0}]
["10.b. Regenerative Stormwater Conveyance (P-CNV-04)",{"$f":"Constants!$B74","v":0},null,null,null,{"$f":"SUMIF($O$14:$O$103,P161,$H$14:$H$103)","v":0},{"$f":"(Constants!$B$2*($G$7*$D60+$G$8*$E60+$C60*$G$6)*3630+$F60)*$B60/100","v":0},{"$f":"(Constants!$B$2*($G$7*$D60+$G$8*$E60+$C60*$G$6)*3630+$F60)*(1-$B60/100)","v":0},{"$f":"+$G60+$H60","v":0},{"$f":"Constants!C74","v":40},{"$f":"SUMIF($O$13:$O$103,P161,$N$13:$N$103)","v":0},0,0,{"$f":"$K60+$L60-$M60","v":0},null,null,null,{"$f":"Constants!$D74","v":35},{"$f":"SUMIF($O$14:$O$103,$P161,$V$14:$V$103)","v":0},{"$f":"(D60*$R$7)+(C60*$R$6)+(E60*$R$8)","v":0},{"$f":"IFERROR(($S60+$T60)*($G60+$H60*$R60/100)/$I60,0)","v":0},{"$f":"$S60+$T60-$U60","v":0}]
[]
["11. Tree BMP",null,null,null,null,null,null,null,null,null,null,null,null,null,null,null,null,"11. Tree BMP"]
["11.a. Trees over Pervious, A/B (P-FIL-09)",{"$f":"Constants!$B77","v":16},null,null,null,{"$f":"SUMIF($O$14:$O$103,P162,$H$14:$H$103)","v":0},{"$f":"(Constants!$B$2*($G$7*$D63+$G$8*$E63+$C63*$G$6)*3630+$F63)*$B63/100","v":0},{"$f":"(Constants!$B$2*($G$7*$D63+$G$8*$E63+$C63*$G$6)*3630+$F63)*(1-$B63/100)","v":0},{"$f":"+$G63+$H63","v":0},{"$f":"Constants!C77","v":0},{"$f":"SUMIF($O$13:$O$103,P162,$N$13:$N$103)","v":0},{"$f":"(D63*$H$7)+(C63*$H$6)+(E63*$H$8)","v":0},{"$f":"IFERROR(($K63+$L63)*($G63+$H63*$J63/100)/$I63,0)","v":0},{"$f":"$K63+$L63-$M63","v":0},null,null,null,{"$f":"Constants!$D77","v":0},{"$f":"SUMIF($O$14:$O$103,$P162,$V$14:$V$103)","v":0},{"$f":"(D63*$R$7)+(C63*$R$6)+(E63*$R$8)","v":0},{"$f":"IFERROR(($S63+$T63)*($G63+$H63*$R63/100)/$I63,0)","v":0},{"$f":"$S63+$T63-$U63","v":0}]
["11.b. Trees over Pervious, C/D (P-FIL-09)",{"$f":"Constants!$B78","v":12},null,null,null,{"$f":"SUMIF($O$14:$O$103,P163,$H$14:$H$103)","v":0},{"$f":"(Constants!$B$2*($G$7*$D64+$G$8*$E64+$C64*$G$6)*3630+$F64)*$B64/100","v":0},{"$f":"(Constants!$B$2*($G$7*$D64+$G$8*$E64+$C64*$G$6)*3630+$F64)*(1-$B64/100)","v":0},{"$f":"+$G64+$H64","v":0},{"$f":"Constants!C78","v":0},{"$f":"SUMIF($O$13:$O$103,P163,$N$13:$N$103)","v":0},0,{"$f":"IFERROR(($K64+$L64)*($G64+$H64*$J64/100)/$I64,0)","v":0},{"$f":"$K64+$L64-$M64","v":0},null,null,null,{"$f":"Constants!$D78","v":0},{"$f":"SUMIF($O$14:$O$103,$P163,$V$14:$V$103)","v":0},{"$f":"(D64*$R$7)+(C64*$R$6)+(E64*$R$8)","v":0},{"$f":"IFERROR(($S64+$T64)*($G64+$H64*$R64/100)/$I64,0)","v":0},{"$f":"$S64+$T64-$U64","v":0}]
["11.c. Trees over Impervious (P-FIL-09)",{"$f":"Constants!$B79","v":3.5},null,null,null,{"$f":"SUMIF($O$14:$O$103,P164,$H$14:$H$103)","v":0},{"$f":"(Constants!$B$2*($G$7*$D65+$G$8*$E65+$C65*$G$6)*3630+$F65)*$B65/100","v":0},{"$f":"(Constants!$B$2*($G$7*$D65+$G$8*$E65+$C65*$G$6)*3630+$F65)*(1-$B65/100)","v":0},{"$f":"+$G65+$H65","v":0},{"$f":"Constants!C79","v":0},{"$f":"SUMIF($O$13:$O$103,P164,$N$13:$N$103)","v":0},{"$f":"(D65*$H$7)+(C65*$H$6)+(E65*$H$8)","v":0},{"$f":"IFERROR(($K65+$L65)*($G65+$H65*$J65/100)/$I65,0)","v":0},{"$f":"$K65+$L65-$M65","v":0},null,null,null,{"$f":"Constants!$D79","v":0},{"$f":"SUMIF($O$14:$O$103,$P164,$V$14:$V$103)","v":0},{"$f":"(D65*$R$7)+(C65*$R$6)+(E65*$R$8)","v":0},{"$f":"IFERROR(($S65+$T65)*($G65+$H65*$R65/100)/$I65,0)","v":0},{"$f":"$S65+$T65-$U65","v":0}]
[]
[]
[null,null,null,null,"TOTAL IMPERVIOUS COVER TREATED (ac)",{"$f":"SUM(E14:E65)","v":0},"AREA CHECK:",{"$f":"IF(F68>$F$8,\"AREA EXCEEDED!\",\"OK.\")","v":"OK."}]
[null,null,null,null,"TOTAL MIXED OPEN TREATED (ac)",{"$f":"SUM(C14:C65)","v":0},"AREA CHECK:",{"$f":"IF(F69>$F$6,\"AREA EXCEEDED!\",\"OK.\")","v":"OK."}]
[null,null,null,null,"TOTAL MANAGED TURF AREA TREATED (ac)",{"$f":"SUM(D33:D65)","v":0},"AREA CHECK:",{"$f":"IF(F70>$F$7,\"AREA EXCEEDED!\",\"OK.\")","v":"OK."}]
[null,null,null,null,"TOTAL RUNOFF REDUCTION IN D.A. E (ft3)",{"$f":"IFERROR(SUM($G$14:$G$65),0)","v":0}]
[]
[null,null,null,null,null,null,null,"TOTAL PHOSPHORUS AVAILABLE FOR REMOVAL IN D.A. E (lb/yr)",{"$f":"$N$8","v":0},null,null,null,null,null,null,null,null,null,null,null,null,"TOTAL RUNOFF REDUCTION IN D.A. E (ft3)",{"$f":"F71","v":0}]
[null,null,null,null,null,null,null,"TOTAL PHOSPHORUS REMOVED WITH RUNOFF REDUCTION PRACTICES IN D.A. E (lb/yr)",{"$f":"IFERROR(SUM(M14:M65),0)","v":0},null,null,null,null,null,null,null,null,null,null,null,null,"NITROGEN REMOVED WITH RUNOFF REDUCTION PRACTICES IN D.A. E (lb/yr)",{"$f":"SUM($U$14:$U$65)","v":0}]
[null,null,null,null,null,null,null,"TOTAL PHOSPHORUS REMAINING AFTER APPLYING RUNOFF REDUCTION PRACTICES IN D.A. E (lb/yr)",{"$f":"I73-I74","v":0}]
[null,null,null,null,null,null,null,null,null,null,null,null,null,null,null,null,null,null,null,null,null,null,"           SEE WATER QUALITY COMPLIANCE TAB FOR SITE CALCULATIONS (Information Only)"]
[null,null,"SEE WATER QUALITY COMPLIANCE TAB FOR SITE COMPLIANCE CALCULATIONS"]
[]
[]
[]
[]
["12. Wet Swale (no RR)",null,null,null,null,null,null,null,null,null,null,null,null,null,null,null,null,"12. Wet Swale (Coastal Plain) (no RR)"]
["12.a. Wet Swale #1 (P-CNV-03)",{"$f":"Constants!$B82","v":0},null,null,null,{"$f":"SUMIF($O$14:$O$103,P165,$H$14:$H$103)","v":0},{"$f":"(Constants!$B$2*($G$7*$D83+$G$8*$E83+$C83*$G$6)*3630+$F83)*$B83/100","v":0},{"$f":"(Constants!$B$2*($G$7*$D83+$G$8*$E83+$C83*$G$6)*3630+$F83)*(1-$B83/100)","v":0},{"$f":"+$G83+$H83","v":0},{"$f":"Constants!C82","v":20},{"$f":"SUMIF($O$13:$O$103,P165,$N$13:$N$103)","v":0},{"$f":"(D83*$H$7)+(C83*$H$6)+(E83*$H$8)","v":0},{"$f":"IFERROR(($K83+$L83)*($G83+$H83*$J83/100)/$I83,0)","v":0},{"$f":"$K83+$L83-$M83","v":0},null,null,null,{"$f":"Constants!$D82","v":25},{"$f":"SUMIF($O$14:$O$103,$P165,$V$14:$V$103)","v":0},{"$f":"(D83*$R$7)+(C83*$R$6)+(E83*$R$8)","v":0},{"$f":"IFERROR(($S83+$T83)*($G83+$H83*$R83/100)/$I83,0)","v":0},{"$f":"$S83+$T83-$U83","v":0}]
["12.b. Wet Swale #2 (P-CNV-03)",{"$f":"Constants!$B83","v":0},null,null,null,{"$f":"SUMIF($O$14:$O$103,P166,$H$14:$H$103)","v":0},{"$f":"(Constants!$B$2*($G$7*$D84+$G$8*$E84+$C84*$G$6)*3630+$F84)*$B84/100","v":0},{"$f":"(Constants!$B$2*($G$7*$D84+$G$8*$E84+$C84*$G$6)*3630+$F84)*(1-$B84/100)","v":0},{"$f":"+$G84+$H84","v":0},{"$f":"Constants!C83","v":40},{"$f":"SUMIF($O$13:$O$103,P166,$N$13:$N$103)","v":0},{"$f":"(D84*$H$7)+(C84*$H$6)+(E84*$H$8)","v":0},{"$f":"IFERROR(($K84+$L84)*($G84+$H84*$J84/100)/$I84,0)","v":0},{"$f":"$K84+$L84-$M84","v":0},null,null,null,{"$f":"Constants!$D83","v":35},{"$f":"SUMIF($O$14:$O$103,$P166,$V$14:$V$103)","v":0},{"$f":"(D84*$R$7)+(C84*$R$6)+(E84*$R$8)","v":0},{"$f":"IFERROR(($S84+$T84)*($G84+$H84*$R84/100)/$I84,0)","v":0},{"$f":"$S84+$T84-$U84","v":0}]
[]
["13.  Filtering Practices (no RR)",null,null,null,null,null,null,null,null,null,null,null,null,null,null,null,null,"13.  Filtering Practices (no RR)"]
["13.a.Filtering Practice #1 (P-FIL-06)",{"$f":"Constants!$B86","v":0},null,null,null,{"$f":"SUMIF($O$14:$O$103,P167,$H$14:$H$103)","v":0},{"$f":"(Constants!$B$2*($G$7*$D87+$G$8*$E87+$C87*$G$6)*3630+$F87)*$B87/100","v":0},{"$f":"(Constants!$B$2*($G$7*$D87+$G$8*$E87+$C87*$G$6)*3630+$F87)*(1-$B87/100)","v":0},{"$f":"+$G87+$H87","v":0},{"$f":"Constants!C86","v":60},{"$f":"SUMIF($O$13:$O$103,P167,$N$13:$N$103)","v":0},{"$f":"(D87*$H$7)+(C87*$H$6)+(E87*$H$8)","v":0},{"$f":"IFERROR(($K87+$L87)*($G87+$H87*$J87/100)/$I87,0)","v":0},{"$f":"$K87+$L87-$M87","v":0},null,null,null,{"$f":"Constants!$D86","v":30},{"$f":"SUMIF($O$14:$O$103,$P167,$V$14:$V$103)","v":0},{"$f":"(D87*$R$7)+(C87*$R$6)+(E87*$R$8)","v":0},{"$f":"IFERROR(($S87+$T87)*($G87+$H87*$R87/100)/$I87,0)","v":0},{"$f":"$S87+$T87-$U87","v":0}]
["13.b. Filtering Practice #2 (P-FIL-06)",{"$f":"Constants!$B87","v":0},null,null,null,{"$f":"SUMIF($O$14:$O$103,P168,$H$14:$H$103)","v":0},{"$f":"(Constants!$B$2*($G$7*$D88+$G$8*$E88+$C88*$G$6)*3630+$F88)*$B88/100","v":0},{"$f":"(Constants!$B$2*($G$7*$D88+$G$8*$E88+$C88*$G$6)*3630+$F88)*(1-$B88/100)","v":0},{"$f":"+$G88+$H88","v":0},{"$f":"Constants!C87","v":65},{"$f":"SUMIF($O$13:$O$103,P168,$N$13:$N$103)","v":0},{"$f":"(D88*$H$7)+(C88*$H$6)+(E88*$H$8)","v":0},{"$f":"IFERROR(($K88+$L88)*($G88+$H88*$J88/100)/$I88,0)","v":0},{"$f":"$K88+$L88-$M88","v":0},null,null,null,{"$f":"Constants!$D87","v":45},{"$f":"SUMIF($O$14:$O$103,$P168,$V$14:$V$103)","v":0},{"$f":"(D88*$R$7)+(C88*$R$6)+(E88*$R$8)","v":0},{"$f":"IFERROR(($S88+$T88)*($G88+$H88*$R88/100)/$I88,0)","v":0},{"$f":"$S88+$T88-$U88","v":0}]
[]
["14. Constructed Wetland (no RR)",null,null,null,null,null,null,null,null,null,null,null,null,null,null,null,null,"14. Constructed Wetland (no RR)"]
["14.a.Constructed Wetland #1 (P-BAS-01)",{"$f":"Constants!$B90","v":0},null,null,null,{"$f":"SUMIF($O$14:$O$103,P169,$H$14:$H$103)","v":0},{"$f":"(Constants!$B$2*($G$7*$D91+$G$8*$E91+$C91*$G$6)*3630+$F91)*$B91/100","v":0},{"$f":"(Constants!$B$2*($G$7*$D91+$G$8*$E91+$C91*$G$6)*3630+$F91)*(1-$B91/100)","v":0},{"$f":"+$G91+$H91","v":0},{"$f":"Constants!C90","v":50},{"$f":"SUMIF($O$13:$O$103,P169,$N$13:$N$103)","v":0},{"$f":"(D91*$H$7)+(C91*$H$6)+(E91*$H$8)","v":0},{"$f":"IFERROR(($K91+$L91)*($G91+$H91*$J91/100)/$I91,0)","v":0},{"$f":"$K91+$L91-$M91","v":0},null,null,null,{"$f":"Constants!$D90","v":25},{"$f":"SUMIF($O$14:$O$103,$P169,$V$14:$V$103)","v":0},{"$f":"(D91*$R$7)+(C91*$R$6)+(E91*$R$8)","v":0},{"$f":"IFERROR(($S91+$T91)*($G91+$H91*$R91/100)/$I91,0)","v":0},{"$f":"$S91+$T91-$U91","v":0}]
["14.b. Constructed Wetland #2 (P-BAS-01)",{"$f":"Constants!$B91","v":0},null,null,null,{"$f":"SUMIF($O$14:$O$103,P170,$H$14:$H$103)","v":0},{"$f":"(Constants!$B$2*($G$7*$D92+$G$8*$E92+$C92*$G$6)*3630+$F92)*$B92/100","v":0},{"$f":"(Constants!$B$2*($G$7*$D92+$G$8*$E92+$C92*$G$6)*3630+$F92)*(1-$B92/100)","v":0},{"$f":"+$G92+$H92","v":0},{"$f":"Constants!C91","v":75},{"$f":"SUMIF($O$13:$O$103,P170,$N$13:$N$103)","v":0},{"$f":"(D92*$H$7)+(C92*$H$6)+(E92*$H$8)","v":0},{"$f":"IFERROR(($K92+$L92)*($G92+$H92*$J92/100)/$I92,0)","v":0},{"$f":"$K92+$L92-$M92","v":0},null,null,null,{"$f":"Constants!$D91","v":55},{"$f":"SUMIF($O$14:$O$103,$P170,$V$14:$V$103)","v":0},{"$f":"(D92*$R$7)+(C92*$R$6)+(E92*$R$8)","v":0},{"$f":"IFERROR(($S92+$T92)*($G92+$H92*$R92/100)/$I92,0)","v":0},{"$f":"$S92+$T92-$U92","v":0}]
[]
["15. Wet Ponds (no RR)",null,null,null,null,null,null,null,null,null,null,null,null,null,null,null,null,"15. Wet Ponds (no RR)"]
["15.a. Wet Pond #1 (P-BAS-02)",{"$f":"Constants!$B94","v":0},null,null,null,{"$f":"SUMIF($O$14:$O$103,P171,$H$14:$H$103)","v":0},{"$f":"(Constants!$B$2*($G$7*$D95+$G$8*$E95+$C95*$G$6)*3630+$F95)*$B95/100","v":0},{"$f":"(Constants!$B$2*($G$7*$D95+$G$8*$E95+$C95*$G$6)*3630+$F95)*(1-$B95/100)","v":0},{"$f":"+$G95+$H95","v":0},{"$f":"Constants!C94","v":50},{"$f":"SUMIF($O$13:$O$103,P171,$N$13:$N$103)","v":0},{"$f":"(D95*$H$7)+(C95*$H$6)+(E95*$H$8)","v":0},{"$f":"IFERROR(($K95+$L95)*($G95+$H95*$J95/100)/$I95,0)","v":0},{"$f":"$K95+$L95-$M95","v":0},null,null,null,{"$f":"Constants!$D94","v":30},{"$f":"SUMIF($O$14:$O$103,$P171,$V$14:$V$103)","v":0},{"$f":"(D95*$R$7)+(C95*$R$6)+(E95*$R$8)","v":0},{"$f":"IFERROR(($S95+$T95)*($G95+$H95*$R95/100)/$I95,0)","v":0},{"$f":"$S95+$T95-$U95","v":0}]
["15.b. Wet Pond #1 (Coastal Plain) (P-BAS-02)",{"$f":"Constants!$B95","v":0},null,null,null,{"$f":"SUMIF($O$14:$O$103,P172,$H$14:$H$103)","v":0},{"$f":"(Constants!$B$2*($G$7*$D96+$G$8*$E96+$C96*$G$6)*3630+$F96)*$B96/100","v":0},{"$f":"(Constants!$B$2*($G$7*$D96+$G$8*$E96+$C96*$G$6)*3630+$F96)*(1-$B96/100)","v":0},{"$f":"+$G96+$H96","v":0},{"$f":"Constants!C95","v":45},{"$f":"SUMIF($O$13:$O$103,P172,$N$13:$N$103)","v":0},{"$f":"(D96*$H$7)+(C96*$H$6)+(E96*$H$8)","v":0},{"$f":"IFERROR(($K96+$L96)*($G96+$H96*$J96/100)/$I96,0)","v":0},{"$f":"$K96+$L96-$M96","v":0},null,null,null,{"$f":"Constants!$D95","v":20},{"$f":"SUMIF($O$14:$O$103,$P172,$V$14:$V$103)","v":0},{"$f":"(D96*$R$7)+(C96*$R$6)+(E96*$R$8)","v":0},{"$f":"IFERROR(($S96+$T96)*($G96+$H96*$R96/100)/$I96,0)","v":0},{"$f":"$S96+$T96-$U96","v":0}]
["15.c. Wet Pond #2 (P-BAS-02)",{"$f":"Constants!$B96","v":0},null,null,null,{"$f":"SUMIF($O$14:$O$103,P173,$H$14:$H$103)","v":0},{"$f":"(Constants!$B$2*($G$7*$D97+$G$8*$E97+$C97*$G$6)*3630+$F97)*$B97/100","v":0},{"$f":"(Constants!$B$2*($G$7*$D97+$G$8*$E97+$C97*$G$6)*3630+$F97)*(1-$B97/100)","v":0},{"$f":"+$G97+$H97","v":0},{"$f":"Constants!C96","v":75},{"$f":"SUMIF($O$13:$O$103,P173,$N$13:$N$103)","v":0},{"$f":"(D97*$H$7)+(C97*$H$6)+(E97*$H$8)","v":0},{"$f":"IFERROR(($K97+$L97)*($G97+$H97*$J97/100)/$I97,0)","v":0},{"$f":"$K97+$L97-$M97","v":0},null,null,null,{"$f":"Constants!$D96","v":40},{"$f":"SUMIF($O$14:$O$103,$P173,$V$14:$V$103)","v":0},{"$f":"(D97*$R$7)+(C97*$R$6)+(E97*$R$8)","v":0},{"$f":"IFERROR(($S97+$T97)*($G97+$H97*$R97/100)/$I97,0)","v":0},{"$f":"$S97+$T97-$U97","v":0}]
["15.d. Wet Pond #2 (Coastal Plain) (P-BAS-02)",{"$f":"Constants!$B97","v":0},null,null,null,{"$f":"SUMIF($O$14:$O$103,P174,$H$14:$H$103)","v":0},{"$f":"(Constants!$B$2*($G$7*$D98+$G$8*$E98+$C98*$G$6)*3630+$F98)*$B98/100","v":0},{"$f":"(Constants!$B$2*($G$7*$D98+$G$8*$E98+$C98*$G$6)*3630+$F98)*(1-$B98/100)","v":0},{"$f":"+$G98+$H98","v":0},{"$f":"Constants!C97","v":65},{"$f":"SUMIF($O$13:$O$103,P174,$N$13:$N$103)","v":0},{"$f":"(D98*$H$7)+(C98*$H$6)+(E98*$H$8)","v":0},{"$f":"IFERROR(($K98+$L98)*($G98+$H98*$J98/100)/$I98,0)","v":0},{"$f":"$K98+$L98-$M98","v":0},null,null,null,{"$f":"Constants!$D97","v":30},{"$f":"SUMIF($O$14:$O$103,$P174,$V$14:$V$103)","v":0},{"$f":"(D98*$R$7)+(C98*$R$6)+(E98*$R$8)","v":0},{"$f":"IFERROR(($S98+$T98)*($G98+$H98*$R98/100)/$I98,0)","v":0},{"$f":"$S98+$T98-$U98","v":0}]
[]
["16. Manufactured Treatment Devices (no RR)",null,null,null,null,null,null,null,null,null,null,null,null,null,null,null,null,"16. Manufactured BMP (no RR)"]
["16.a. Manufactured Treatment Device-Hydrodynamic",{"$f":"Constants!$B100","v":0},null,null,null,{"$f":"SUMIF($O$14:$O$103,P175,$H$14:$H$103)","v":0},{"$f":"(Constants!$B$2*($G$7*$D101+$G$8*$E101+$C101*$G$6)*3630+$F101)*$B101/100","v":0},{"$f":"(Constants!$B$2*($G$7*$D101+$G$8*$E101+$C101*$G$6)*3630+$F101)*(1-$B101/100)","v":0},{"$f":"+$G101+$H101","v":0},20,{"$f":"SUMIF($O$13:$O$103,P175,$N$13:$N$103)","v":0},{"$f":"(D101*$H$7)+(C101*$H$6)+(E101*$H$8)","v":0},{"$f":"IFERROR(($K101+$L101)*($G101+$H101*$J101/100)/$I101,0)","v":0},{"$f":"$K101+$L101-$M101","v":0},null,null,null,0,{"$f":"SUMIF($O$14:$O$103,$P175,$V$14:$V$103)","v":0},{"$f":"(D101*$R$7)+(C101*$R$6)+(E101*$R$8)","v":0},{"$f":"IFERROR(($S101+$T101)*($G101+$H101*$R101/100)/$I101,0)","v":0},{"$f":"$S101+$T101-$U101","v":0}]
["16.b. Manufactured Treatment Device-Filtering",{"$f":"Constants!$B101","v":0},null,null,null,{"$f":"SUMIF($O$14:$O$103,P176,$H$14:$H$103)","v":0},{"$f":"(Constants!$B$2*($G$7*$D102+$G$8*$E102+$C102*$G$6)*3630+$F102)*$B102/100","v":0},{"$f":"(Constants!$B$2*($G$7*$D102+$G$8*$E102+$C102*$G$6)*3630+$F102)*(1-$B102/100)","v":0},{"$f":"+$G102+$H102","v":0},20,{"$f":"SUMIF($O$13:$O$103,P176,$N$13:$N$103)","v":0},{"$f":"(D102*$H$7)+(C102*$H$6)+(E102*$H$8)","v":0},{"$f":"IFERROR(($K102+$L102)*($G102+$H102*$J102/100)/$I102,0)","v":0},{"$f":"$K102+$L102-$M102","v":0},null,null,null,0,{"$f":"SUMIF($O$14:$O$103,$P176,$V$14:$V$103)","v":0},{"$f":"(D102*$R$7)+(C102*$R$6)+(E102*$R$8)","v":0},{"$f":"IFERROR(($S102+$T102)*($G102+$H102*$R102/100)/$I102,0)","v":0},{"$f":"$S102+$T102-$U102","v":0}]
["16.c. Manufactured Treatment Device-Generic",{"$f":"Constants!$B102","v":0},null,null,null,{"$f":"SUMIF($O$14:$O$103,P177,$H$14:$H$103)","v":0},{"$f":"(Constants!$B$2*($G$7*$D103+$G$8*$E103+$C103*$G$6)*3630+$F103)*$B103/100","v":0},{"$f":"(Constants!$B$2*($G$7*$D103+$G$8*$E103+$C103*$G$6)*3630+$F103)*(1-$B103/100)","v":0},{"$f":"+$G103+$H103","v":0},20,{"$f":"SUMIF($O$13:$O$103,P177,$N$13:$N$103)","v":0},{"$f":"(D103*$H$7)+(C103*$H$6)+(E103*$H$8)","v":0},{"$f":"IFERROR(($K103+$L103)*($G103+$H103*$J103/100)/$I103,0)","v":0},{"$f":"$K103+$L103-$M103","v":0},null,null,null,0,{"$f":"SUMIF($O$14:$O$103,$P177,$V$14:$V$103)","v":0},{"$f":"(D103*$R$7)+(C103*$R$6)+(E103*$R$8)","v":0},{"$f":"IFERROR(($S103+$T103)*($G103+$H103*$R103/100)/$I103,0)","v":0},{"$f":"$S103+$T103-$U103","v":0}]
[]
[]
[]
[null,null,null,null,"TOTAL IMPERVIOUS COVER TREATED (ac)",{"$f":"SUM($E$14:$E$103)","v":0},"AREA CHECK:",{"$f":"IF($F$107>$F$8,\"AREA EXCEEDED!\",\"OK.\")","v":"OK."}]
[null,null,null,null,"TOTAL MIXED OPEN TREATED (ac)",{"$f":"SUM($C$14:$C$103)","v":0},"AREA CHECK:",{"$f":"IF($F$108>$F$6,\"AREA EXCEEDED!\",\"OK.\")","v":"OK."}]
[null,null,null,null,"TOTAL MANAGED TURF AREA TREATED (ac)",{"$f":"SUM($D$14:$D$103)","v":0},"AREA CHECK:",{"$f":"IF($F$109>$F$7,\"AREA EXCEEDED!\",\"OK.\")","v":"OK."}]
[]
[null,null,null,null,null,null,null,"TOTAL PHOSPHORUS REMOVAL REQUIRED ON SITE (lb/yr)",{"$f":"IF(Site!$E$21=\"Check Areas!\",\"ERROR - \",Site!$E$21)","v":0},{"$f":"IF(I111=\"ERROR - \",\"Site Data Tab\",\"\")","v":""}]
[]
[null,null,null,null,null,null,null,"TOTAL PHOSPHORUS AVAILABLE FOR REMOVAL IN D.A. E (lb/yr)",{"$f":"$N$8","v":0}]
[null,null,null,null,null,null,null,"TOTAL PHOSPHORUS REMOVED WITHOUT RUNOFF REDUCTION PRACTICES IN D.A. E (lb/yr)",{"$f":"SUM($M$83:$M$103)","v":0}]
[null,null,null,null,null,null,null,"TOTAL PHOSPHORUS REMOVED WITH RUNOFF REDUCTION PRACTICES IN D.A. E (lb/yr)",{"$f":"$I$74","v":0}]
[null,null,null,null,null,null,null,"TOTAL PHOSPHORUS LOAD REDUCTION ACHIEVED IN D.A. E (lb/yr)",{"$f":"$I$114+$I$115","v":0}]
[null,null,null,null,null,null,null,"TOTAL PHOSPHORUS REMAINING AFTER APPLYING BMP LOAD REDUCTIONS IN D.A. E (lb/yr)",{"$f":"$I$113-$I$116","v":0}]
[]
[null,null,"SEE WATER QUALITY COMPLIANCE TAB FOR SITE COMPLIANCE CALCULATIONS"]
[]
[null,null,null,null,null,null,null,"NITROGEN REMOVED WITH RUNOFF REDUCTION PRACTICES IN D.A. E (lb/yr)",{"$f":"IFERROR(SUM($U$14:$U$65),0)","v":0}]
[null,null,null,null,null,null,null,"NITROGEN REMOVED WITHOUT RUNOFF REDUCTION PRACTICES IN D.A. E (lb/yr)",{"$f":"SUM($U$83:$U$103)","v":0}]
[null,null,null,null,null,null,null,"TOTAL NITROGEN REMOVED IN D.A. E (lb/yr)",{"$f":"$I$121+$I$122","v":0}]
[]
[]
[]
[]
[]
[]
[]
[null,null,"Downstream Practices - Dropdown selections for each applicable BMP"]
[]
["Options for 1. Green Roof",null,"Options for 2. Impervious Surface Disconnection",null,"Options for 3a. Pervious Parking, A/B Soils",null,"Options for 4a. Grass Channels, A/B Soils",null,null,"Options for 4b. Grass Channels, C/D Soils"]
[null,null,null,null,null,null,null,null,null,null,null,"Options for 4.c. Grass Channel Compost Amended Soils",null,null,null,"Master Downstream BMP Reference List"]
[{"$f":"P135","v":"None"},null,{"$f":"P135","v":"None"},null,{"$f":"P135","v":"None"},null,{"$f":"P135","v":"None"},null,null,{"$f":"P135","v":"None"},null,null,null,null,null,"None"]
["2.a. Simple Disconnection to A/B Soils",null,{"$f":"P146","v":"4.a. Grass Channel A/B Soils"},null,{"$f":"P146","v":"4.a. Grass Channel A/B Soils"},null,{"$f":"P147","v":"4.b. Grass Channel C/D Soils"},null,null,{"$f":"P146","v":"4.a. Grass Channel A/B Soils"},null,{"$f":"P135","v":"None"},null,null,null,"2.a. Simple Disconnection to A/B Soils"]
["2.b. Simple Disconnection to C/D Soils",null,"4.b. Grass Channel C/D Soils",null,"4.b. Grass Channel C/D Soils",null,"4.c. Grass Channel Compost Amended Soils",null,null,{"$f":"P148","v":"4.c. Grass Channel Compost Amended Soils"},null,{"$f":"P146","v":"4.a. Grass Channel A/B Soils"},null,null,null,"2.b. Simple Disconnection to C/D Soils"]
["2.c. To Soil Amended Filter Path",null,"4.c. Grass Channel Compost Amended Soils",null,"4.c. Grass Channel Compost Amended Soils",null,"5.a. Dry Swale #1",null,null,"5.a. Dry Swale #1",null,{"$f":"P147","v":"4.b. Grass Channel C/D Soils"},null,null,null,"2.c. To Soil Amended Filter Path"]
["2.d. To Dry Well/French Drain #1 (Micro-Infiltration #1)",null,"5.a. Dry Swale #1",null,"5.a. Dry Swale #1",null,"5.b. Dry Swale #2",null,null,"5.b. Dry Swale #2",null,{"$f":"P149","v":"5.a. Dry Swale #1"},null,null,null,"2.d. To Dry Well/French Drain #1 (Micro-Infiltration #1)"]
["2.e. To Dry Well/French Drain #2 (Micro-Infiltration. #2)",null,"5.b. Dry Swale #2",null,"5.b. Dry Swale #2",null,"6.a. Bioretention #1",null,null,"6.a. Bioretention #1",null,"5.b. Dry Swale #2",null,null,null,"2.e. To Dry Well/French Drain #2 (Micro-Infiltration. #2)"]
["2.f. To Rain Garden #1 (Micro-Bioretention #1)",null,"6.a. Bioretention #1",null,"6.a. Bioretention #1",null,"6.b. Bioretention #2",null,null,"6.b. Bioretention #2",null,"6.a. Bioretention #1",null,null,null,"2.f. To Rain Garden #1 (Micro-Bioretention #1)"]
["2.g. To Rain Garden #2 (Micro-Bioretention #2)",null,"6.b. Bioretention #2",null,"6.b. Bioretention #2",null,"7.a. Infiltration #1",null,null,"7.a. Infiltration #1",null,"6.b. Bioretention #2",null,null,null,"2.g. To Rain Garden #2 (Micro-Bioretention #2)"]
["2.h. To Train Barrel, Rain Tank, or Cistern",null,"7.a. Infiltration #1",null,"7.a. Infiltration #1",null,"7.b. Infiltration #2",null,null,"7.b. Infiltration #2",null,"7.a. Infiltration #1",null,null,null,"2.h. To Train Barrel, Rain Tank, or Cistern"]
["2.i. To Stormwater Planter (Urban Bioretention)",null,"7.b. Infiltration #2",null,"7.b. Infiltration #2",null,"8.a. ED #1",null,null,"8.a. ED #1",null,"7.b. Infiltration #2",null,null,null,"2.i. To Stormwater Planter (Urban Bioretention)"]
["3.a. Permeable Pavement #1",null,"8.a. ED #1",null,"8.a. ED #1",null,"8.b. ED #2",null,null,"8.b. ED #2",null,"8.a. ED #1",null,null,null,"3.a. Permeable Pavement #1"]
["4.a. Grass Channel A/B Soils",null,"8.b. ED #2",null,"8.b. ED #2",null,"9.a. Sheetflow to A/B Soil Conservation Area ",null,null,"9.a. Sheetflow to A/B Soil Conservation Area ",null,"8.b. ED #2",null,null,null,"4.a. Grass Channel A/B Soils"]
["4.b. Grass Channel C/D Soils",null,"9.a. Sheetflow to A/B Soil Conservation Area ",null,"9.a. Sheetflow to A/B Soil Conservation Area ",null,"9.b. Sheetflow to C/D Soil Conservation Area",null,null,"9.b. Sheetflow to C/D Soil Conservation Area",null,"9.a. Sheetflow to A/B Soil Conservation Area ",null,null,null,"4.b. Grass Channel C/D Soils"]
["4.c. Grass Channel Compost Amended Soils",null,"9.b. Sheetflow to C/D Soil Conservation Area",null,"9.b. Sheetflow to C/D Soil Conservation Area",null,"9.c. Sheetflow to Vegetated Filter Strip",null,null,"9.c. Sheetflow to Vegetated Filter Strip",null,"9.b. Sheetflow to C/D Soil Conservation Area",null,null,null,"4.c. Grass Channel Compost Amended Soils"]
["5.a. Dry Swale #1",null,"9.c. Sheetflow to Vegetated Filter Strip",null,"9.c. Sheetflow to Vegetated Filter Strip",null,"10.a. Regenerative Stormwater Conveyance #1",null,null,"10.a. Regenerative Stormwater Conveyance #1",null,"9.c. Sheetflow to Vegetated Filter Strip",null,null,null,"5.a. Dry Swale #1"]
["5.b. Dry Swale #2",null,"10.a. Regenerative Stormwater Conveyance #1",null,"10.a. Regenerative Stormwater Conveyance #1",null,"10.b. Regenerative Stormwater Conveyance #2",null,null,"10.b. Regenerative Stormwater Conveyance #2",null,"10.a. Regenerative Stormwater Conveyance #1",null,null,null,"5.b. Dry Swale #2"]
["6.a. Bioretention #1",null,"10.b. Regenerative Stormwater Conveyance #2",null,"10.b. Regenerative Stormwater Conveyance #2",null,{"$f":"P165","v":"12.a. Wet Swale #1"},null,null,{"$f":"P165","v":"12.a. Wet Swale #1"},null,"10.b. Regenerative Stormwater Conveyance #2",null,null,null,"6.a. Bioretention #1"]
["6.b. Bioretention #2",null,{"$f":"P165","v":"12.a. Wet Swale #1"},null,{"$f":"P165","v":"12.a. Wet Swale #1"},null,"12.b. Wet Swale #2",null,null,"12.b. Wet Swale #2",null,{"$f":"P165","v":"12.a. Wet Swale #1"},null,null,null,"6.b. Bioretention #2"]
["7.a. Infiltration #1",null,"12.b. Wet Swale #2",null,"12.b. Wet Swale #2",null,"13.a. Filtering Practice #1",null,null,"13.a. Filtering Practice #1",null,"12.b. Wet Swale #2",null,null,null,"7.a. Infiltration #1"]
["7.b. Infiltration #2",null,"13.a. Filtering Practice #1",null,"13.a. Filtering Practice #1",null,"13.b. Filtering Practice #2",null,null,"13.b. Filtering Practice #2",null,"13.a. Filtering Practice #1",null,null,null,"7.b. Infiltration #2"]
["8.a. ED #1",null,"13.b. Filtering Practice #2",null,"13.b. Filtering Practice #2",null,"14.a. Constructed Wetland #1",null,null,"14.a. Constructed Wetland #1",null,"13.b. Filtering Practice #2",null,null,null,"8.a. ED #1"]
["8.b. ED #2",null,"14.a. Constructed Wetland #1",null,"14.a. Constructed Wetland #1",null,"14.b. Constructed Wetland #2",null,null,"14.b. Constructed Wetland #2",null,"14.a. Constructed Wetland #1",null,null,null,"8.b. ED #2"]
["9.a. Sheetflow to A/B Soil Conservation Area ",null,"14.b. Constructed Wetland #2",null,"14.b. Constructed Wetland #2",null,"15.a. Wet Pond #1",null,null,"15.a. Wet Pond #1",null,"14.b. Constructed Wetland #2",null,null,null,"9.a. Sheetflow to A/B Soil Conservation Area "]
["9.b. Sheetflow to C/D Soil Conservation Area",null,"15.a. Wet Pond #1",null,"15.a. Wet Pond #1",null,"15.b. Wet Pond #1 (Coastal Plain)",null,null,"15.b. Wet Pond #1 (Coastal Plain)",null,"15.a. Wet Pond #1",null,null,null,"9.b. Sheetflow to C/D Soil Conservation Area"]
["9.c. Sheetflow to Vegetated Filter Strip",null,"15.b. Wet Pond #1 (Coastal Plain)",null,"15.b. Wet Pond #1 (Coastal Plain)",null,"15.c. Wet Pond #2",null,null,"15.c. Wet Pond #2",null,"15.b. Wet Pond #1 (Coastal Plain)",null,null,null,"9.c. Sheetflow to Vegetated Filter Strip"]
["10.a. Regenerative Stormwater Conveyance #1",null,"15.c. Wet Pond #2",null,"15.c. Wet Pond #2",null,"15.d. Wet Pond #2 (Coastal Plain)",null,null,"15.d. Wet Pond #2 (Coastal Plain)",null,"15.c. Wet Pond #2",null,null,null,"10.a. Regenerative Stormwater Conveyance #1"]
["10.b. Regenerative Stormwater Conveyance #2",null,"15.d. Wet Pond #2 (Coastal Plain)",null,"15.d. Wet Pond #2 (Coastal Plain)",null,"16.a. MTD - Hydrodynamic",null,null,"16.a. MTD - Hydrodynamic",null,"15.d. Wet Pond #2 (Coastal Plain)",null,null,null,"10.b. Regenerative Stormwater Conveyance #2"]
[{"$f":"P165","v":"12.a. Wet Swale #1"},null,"16.a. MTD - Hydrodynamic",null,"16.a. MTD - Hydrodynamic",null,"16.b. MTD - Filtering",null,null,"16.b. MTD - Filtering",null,"16.a. MTD - Hydrodynamic",null,null,null,"11.a. Trees over Pervious, A/B"]
["12.b. Wet Swale #2",null,"16.b. MTD - Filtering",null,"16.b. MTD - Filtering",null,"16.c. MTD - Generic",null,null,"16.c. MTD - Generic",null,"16.b. MTD - Filtering",null,null,null,"11.b. Trees over Pervious, B/C"]
["13.a. Filtering Practice #1",null,"16.c. MTD - Generic",null,"16.c. MTD - Generic",null,null,null,null,null,null,"16.c. MTD - Generic",null,null,null,"11.c. Trees over Impervious"]
["13.b. Filtering Practice #2",null,null,null,null,null,null,null,null,null,null,null,null,null,null,"12.a. Wet Swale #1"]
["14.a. Constructed Wetland #1",null,null,null,null,null,null,null,null,null,null,null,null,null,null,"12.b. Wet Swale #2"]
["14.b. Constructed Wetland #2",null,null,null,null,null,null,null,null,null,null,null,null,null,null,"13.a. Filtering Practice #1"]
["15.a. Wet Pond #1",null,null,null,null,null,null,null,null,null,null,null,null,null,null,"13.b. Filtering Practice #2"]
["15.b. Wet Pond #1 (Coastal Plain)",null,null,null,null,null,null,null,null,null,null,null,null,null,null,"14.a. Constructed Wetland #1"]
["15.c. Wet Pond #2",null,null,null,null,null,null,null,null,null,null,null,null,null,null,"14.b. Constructed Wetland #2"]
["15.d. Wet Pond #2 (Coastal Plain)",null,null,null,null,null,null,null,null,null,null,null,null,null,null,"15.a. Wet Pond #1"]
["16.a. MTD - Hydrodynamic",null,null,null,null,null,null,null,null,null,null,null,null,null,null,"15.b. Wet Pond #1 (Coastal Plain)"]
["16.b. MTD - Filtering",null,null,null,null,null,null,null,null,null,null,null,null,null,null,"15.c. Wet Pond #2"]
["16.c. MTD - Generic",null,null,null,null,null,null,null,null,null,null,null,null,null,null,"15.d. Wet Pond #2 (Coastal Plain)"]
[null,null,null,null,null,null,null,null,null,null,null,null,null,null,null,"16.a. MTD - Hydrodynamic"]
["Options for 5a. Dry Swale #1",null,"Options for 5b. Dry Swale #2",null,"Options for 6a. Bioretention #1",null,"Options for 6b. Bioretention #2",null,null,"Options for 7a. Infiltration #1",null,"Options for 7b. Infiltration #2",null,null,null,"16.b. MTD - Filtering"]
[null,null,null,null,null,null,null,null,null,null,null,null,null,null,null,"16.c. MTD - Generic"]
[{"$f":"P135","v":"None"},null,{"$f":"P135","v":"None"},null,{"$f":"P135","v":"None"},null,{"$f":"P135","v":"None"},null,null,{"$f":"P135","v":"None"},null,{"$f":"P135","v":"None"}]
[{"$f":"P146","v":"4.a. Grass Channel A/B Soils"},null,{"$f":"P146","v":"4.a. Grass Channel A/B Soils"},null,{"$f":"P146","v":"4.a. Grass Channel A/B Soils"},null,{"$f":"P146","v":"4.a. Grass Channel A/B Soils"},null,null,{"$f":"P146","v":"4.a. Grass Channel A/B Soils"},null,{"$f":"P146","v":"4.a. Grass Channel A/B Soils"}]
[{"$f":"P147","v":"4.b. Grass Channel C/D Soils"},null,{"$f":"P147","v":"4.b. Grass Channel C/D Soils"},null,{"$f":"P147","v":"4.b. Grass Channel C/D Soils"},null,"4.b. Grass Channel C/D Soils",null,null,"4.b. Grass Channel C/D Soils",null,"4.b. Grass Channel C/D Soils"]
[{"$f":"P148","v":"4.c. Grass Channel Compost Amended Soils"},null,{"$f":"P148","v":"4.c. Grass Channel Compost Amended Soils"},null,{"$f":"P148","v":"4.c. Grass Channel Compost Amended Soils"},null,"4.c. Grass Channel Compost Amended Soils",null,null,"4.c. Grass Channel Compost Amended Soils",null,"4.c. Grass Channel Compost Amended Soils"]
[{"$f":"P150","v":"5.b. Dry Swale #2"},null,{"$f":"P149","v":"5.a. Dry Swale #1"},null,{"$f":"P149","v":"5.a. Dry Swale #1"},null,"5.a. Dry Swale #1",null,null,"5.a. Dry Swale #1",null,"5.a. Dry Swale #1"]
["6.a. Bioretention #1",null,{"$f":"P151","v":"6.a. Bioretention #1"},null,{"$f":"P150","v":"5.b. Dry Swale #2"},null,"5.b. Dry Swale #2",null,null,"5.b. Dry Swale #2",null,"5.b. Dry Swale #2"]
["6.b. Bioretention #2",null,"6.b. Bioretention #2",null,{"$f":"P152","v":"6.b. Bioretention #2"},null,"6.a. Bioretention #1",null,null,"6.a. Bioretention #1",null,"6.a. Bioretention #1"]
["7.a. Infiltration #1",null,"7.a. Infiltration #1",null,"7.a. Infiltration #1",null,{"$f":"P153","v":"7.a. Infiltration #1"},null,null,"6.b. Bioretention #2",null,"6.b. Bioretention #2"]
["7.b. Infiltration #2",null,"7.b. Infiltration #2",null,"7.b. Infiltration #2",null,"7.b. Infiltration #2",null,null,{"$f":"P154","v":"7.b. Infiltration #2"},null,"7.a. Infiltration #1"]
["8.a. ED #1",null,"8.a. ED #1",null,"8.a. ED #1",null,"8.a. ED #1",null,null,"8.a. ED #1",null,{"$f":"P155","v":"8.a. ED #1"}]
["8.b. ED #2",null,"8.b. ED #2",null,"8.b. ED #2",null,"8.b. ED #2",null,null,"8.b. ED #2",null,"8.b. ED #2"]
["9.a. Sheetflow to A/B Soil Conservation Area ",null,"9.a. Sheetflow to A/B Soil Conservation Area ",null,"9.a. Sheetflow to A/B Soil Conservation Area ",null,"9.a. Sheetflow to A/B Soil Conservation Area ",null,null,"9.a. Sheetflow to A/B Soil Conservation Area ",null,"9.a. Sheetflow to A/B Soil Conservation Area "]
["9.b. Sheetflow to C/D Soil Conservation Area",null,"9.b. Sheetflow to C/D Soil Conservation Area",null,"9.b. Sheetflow to C/D Soil Conservation Area",null,"9.b. Sheetflow to C/D Soil Conservation Area",null,null,"9.b. Sheetflow to C/D Soil Conservation Area",null,"9.b. Sheetflow to C/D Soil Conservation Area"]
["9.c. Sheetflow to Vegetated Filter Strip",null,"9.c. Sheetflow to Vegetated Filter Strip",null,"9.c. Sheetflow to Vegetated Filter Strip",null,"9.c. Sheetflow to Vegetated Filter Strip",null,null,"9.c. Sheetflow to Vegetated Filter Strip",null,"9.c. Sheetflow to Vegetated Filter Strip"]
["10.a. Regenerative Stormwater Conveyance #1",null,"10.a. Regenerative Stormwater Conveyance #1",null,"10.a. Regenerative Stormwater Conveyance #1",null,"10.a. Regenerative Stormwater Conveyance #1",null,null,"10.a. Regenerative Stormwater Conveyance #1",null,"10.a. Regenerative Stormwater Conveyance #1"]
["10.b. Regenerative Stormwater Conveyance #2",null,"10.b. Regenerative Stormwater Conveyance #2",null,"10.b. Regenerative Stormwater Conveyance #2",null,"10.b. Regenerative Stormwater Conveyance #2",null,null,"10.b. Regenerative Stormwater Conveyance #2",null,"10.b. Regenerative Stormwater Conveyance #2"]
[{"$f":"P165","v":"12.a. Wet Swale #1"},null,{"$f":"P165","v":"12.a. Wet Swale #1"},null,{"$f":"P165","v":"12.a. Wet Swale #1"},null,{"$f":"P165","v":"12.a. Wet Swale #1"},null,null,{"$f":"P165","v":"12.a. Wet Swale #1"},null,{"$f":"P165","v":"12.a. Wet Swale #1"}]
["12.b. Wet Swale #2",null,"12.b. Wet Swale #2",null,"12.b. Wet Swale #2",null,"12.b. Wet Swale #2",null,null,"12.b. Wet Swale #2",null,"12.b. Wet Swale #2"]
["13.a. Filtering Practice #1",null,"13.a. Filtering Practice #1",null,"13.a. Filtering Practice #1",null,"13.a. Filtering Practice #1",null,null,"13.a. Filtering Practice #1",null,"13.a. Filtering Practice #1"]
["13.b. Filtering Practice #2",null,"13.b. Filtering Practice #2",null,"13.b. Filtering Practice #2",null,"13.b. Filtering Practice #2",null,null,"13.b. Filtering Practice #2",null,"13.b. Filtering Practice #2"]
["14.a. Constructed Wetland #1",null,"14.a. Constructed Wetland #1",null,"14.a. Constructed Wetland #1",null,"14.a. Constructed Wetland #1",null,null,"14.a. Constructed Wetland #1",null,"14.a. Constructed Wetland #1"]
["14.b. Constructed Wetland #2",null,"14.b. Constructed Wetland #2",null,"14.b. Constructed Wetland #2",null,"14.b. Constructed Wetland #2",null,null,"14.b. Constructed Wetland #2",null,"14.b. Constructed Wetland #2"]
["15.a. Wet Pond #1",null,"15.a. Wet Pond #1",null,"15.a. Wet Pond #1",null,"15.a. Wet Pond #1",null,null,"15.a. Wet Pond #1",null,"15.a. Wet Pond #1"]
["15.b. Wet Pond #1 (Coastal Plain)",null,"15.b. Wet Pond #1 (Coastal Plain)",null,"15.b. Wet Pond #1 (Coastal Plain)",null,"15.b. Wet Pond #1 (Coastal Plain)",null,null,"15.b. Wet Pond #1 (Coastal Plain)",null,"15.b. Wet Pond #1 (Coastal Plain)"]
["15.c. Wet Pond #2",null,"15.c. Wet Pond #2",null,"15.c. Wet Pond #2",null,"15.c. Wet Pond #2",null,null,"15.c. Wet Pond #2",null,"15.c. Wet Pond #2"]
["15.d. Wet Pond #2 (Coastal Plain)",null,"15.d. Wet Pond #2 (Coastal Plain)",null,"15.d. Wet Pond #2 (Coastal Plain)",null,"15.d. Wet Pond #2 (Coastal Plain)",null,null,"15.d. Wet Pond #2 (Coastal Plain)",null,"15.d. Wet Pond #2 (Coastal Plain)"]
["16.a. MTD - Hydrodynamic",null,"16.a. MTD - Hydrodynamic",null,"16.a. MTD - Hydrodynamic",null,"16.a. MTD - Hydrodynamic",null,null,"16.a. MTD - Hydrodynamic",null,"16.a. MTD - Hydrodynamic"]
["16.b. MTD - Filtering",null,"16.b. MTD - Filtering",null,"16.b. MTD - Filtering",null,"16.b. MTD - Filtering",null,null,"16.b. MTD - Filtering",null,"16.b. MTD - Filtering"]
["16.c. MTD - Generic",null,"16.c. MTD - Generic",null,"16.c. MTD - Generic",null,"16.c. MTD - Generic",null,null,"16.c. MTD - Generic",null,"16.c. MTD - Generic"]
[]
["Options for 8a. Extended Detention #1",null,"Options for 8b. Extended Detention #2",null,"Options for 9 Sheet Flow to Open Space",null,"Options for 9c. Sheet Flow to Filter Strip",null,null,"Options for 10a. Wet Swale #1",null,"Options for 10b. Wet Swale #2"]
[]
[{"$f":"P135","v":"None"},null,{"$f":"P135","v":"None"},null,{"$f":"P135","v":"None"},null,{"$f":"P135","v":"None"},null,null,{"$f":"P135","v":"None"},null,{"$f":"P135","v":"None"}]
[{"$f":"P146","v":"4.a. Grass Channel A/B Soils"},null,{"$f":"P146","v":"4.a. Grass Channel A/B Soils"},null,null,null,{"$f":"P146","v":"4.a. Grass Channel A/B Soils"},null,null,{"$f":"P146","v":"4.a. Grass Channel A/B Soils"},null,{"$f":"P146","v":"4.a. Grass Channel A/B Soils"}]
["4.b. Grass Channel C/D Soils",null,"4.b. Grass Channel C/D Soils",null,null,null,"4.b. Grass Channel C/D Soils",null,null,"4.b. Grass Channel C/D Soils",null,"4.b. Grass Channel C/D Soils"]
["4.c. Grass Channel Compost Amended Soils",null,"4.c. Grass Channel Compost Amended Soils",null,null,null,"4.c. Grass Channel Compost Amended Soils",null,null,"4.c. Grass Channel Compost Amended Soils",null,"4.c. Grass Channel Compost Amended Soils"]
["5.a. Dry Swale #1",null,"5.a. Dry Swale #1",null,null,null,"5.a. Dry Swale #1",null,null,"5.a. Dry Swale #1",null,"5.a. Dry Swale #1"]
["5.b. Dry Swale #2",null,"5.b. Dry Swale #2",null,null,null,"5.b. Dry Swale #2",null,null,"5.b. Dry Swale #2",null,"5.b. Dry Swale #2"]
["6.a. Bioretention #1",null,"6.a. Bioretention #1",null,null,null,"6.a. Bioretention #1",null,null,"6.a. Bioretention #1",null,"6.a. Bioretention #1"]
["6.b. Bioretention #2",null,"6.b. Bioretention #2",null,null,null,"6.b. Bioretention #2",null,null,"6.b. Bioretention #2",null,"6.b. Bioretention #2"]
["7.a. Infiltration #1",null,"7.a. Infiltration #1",null,null,null,"7.a. Infiltration #1",null,null,"7.a. Infiltration #1",null,"7.a. Infiltration #1"]
["7.b. Infiltration #2",null,"7.b. Infiltration #2",null,null,null,"7.b. Infiltration #2",null,null,"7.b. Infiltration #2",null,"7.b. Infiltration #2"]
[{"$f":"P156","v":"8.b. ED #2"},null,"8.a. ED #1",null,null,null,"8.a. ED #1",null,null,"8.a. ED #1",null,"8.a. ED #1"]
["9.a. Sheetflow to A/B Soil Conservation Area ",null,{"$f":"P157","v":"9.a. Sheetflow to A/B Soil Conservation Area "},null,null,null,"8.b. ED #2",null,null,"8.b. ED #2",null,"8.b. ED #2"]
["9.b. Sheetflow to C/D Soil Conservation Area",null,"9.b. Sheetflow to C/D Soil Conservation Area",null,null,null,"9.a. Sheetflow to A/B Soil Conservation Area ",null,null,"9.a. Sheetflow to A/B Soil Conservation Area ",null,"9.a. Sheetflow to A/B Soil Conservation Area "]
["9.c. Sheetflow to Vegetated Filter Strip",null,"9.c. Sheetflow to Vegetated Filter Strip",null,null,null,"9.b. Sheetflow to C/D Soil Conservation Area",null,null,"9.b. Sheetflow to C/D Soil Conservation Area",null,"9.b. Sheetflow to C/D Soil Conservation Area"]
["10.a. Regenerative Stormwater Conveyance #1",null,"10.a. Regenerative Stormwater Conveyance #1",null,null,null,{"$f":"P160","v":"10.a. Regenerative Stormwater Conveyance #1"},null,null,"9.c. Sheetflow to Vegetated Filter Strip",null,"9.c. Sheetflow to Vegetated Filter Strip"]
["10.b. Regenerative Stormwater Conveyance #2",null,"10.b. Regenerative Stormwater Conveyance #2",null,null,null,{"$f":"P161","v":"10.b. Regenerative Stormwater Conveyance #2"},null,null,"10.a. Regenerative Stormwater Conveyance #1",null,"10.a. Regenerative Stormwater Conveyance #1"]
[{"$f":"P165","v":"12.a. Wet Swale #1"},null,{"$f":"P165","v":"12.a. Wet Swale #1"},null,null,null,{"$f":"P165","v":"12.a. Wet Swale #1"},null,null,"10.b. Regenerative Stormwater Conveyance #2",null,"10.b. Regenerative Stormwater Conveyance #2"]
["12.b. Wet Swale #2",null,"12.b. Wet Swale #2",null,null,null,"12.b. Wet Swale #2",null,null,{"$f":"P166","v":"12.b. Wet Swale #2"},null,{"$f":"P165","v":"12.a. Wet Swale #1"}]
["13.a. Filtering Practice #1",null,"13.a. Filtering Practice #1",null,null,null,"13.a. Filtering Practice #1",null,null,"13.a. Filtering Practice #1",null,{"$f":"P167","v":"13.a. Filtering Practice #1"}]
["13.b. Filtering Practice #2",null,"13.b. Filtering Practice #2",null,null,null,"13.b. Filtering Practice #2",null,null,"13.b. Filtering Practice #2",null,"13.b. Filtering Practice #2"]
["14.a. Constructed Wetland #1",null,"14.a. Constructed Wetland #1",null,null,null,"14.a. Constructed Wetland #1",null,null,"14.a. Constructed Wetland #1",null,"14.a. Constructed Wetland #1"]
["14.b. Constructed Wetland #2",null,"14.b. Constructed Wetland #2",null,null,null,"14.b. Constructed Wetland #2",null,null,"14.b. Constructed Wetland #2",null,"14.b. Constructed Wetland #2"]
["15.a. Wet Pond #1",null,"15.a. Wet Pond #1",null,null,null,"15.a. Wet Pond #1",null,null,"15.a. Wet Pond #1",null,"15.a. Wet Pond #1"]
["15.b. Wet Pond #1 (Coastal Plain)",null,"15.b. Wet Pond #1 (Coastal Plain)",null,null,null,"15.b. Wet Pond #1 (Coastal Plain)",null,null,"15.b. Wet Pond #1 (Coastal Plain)",null,"15.b. Wet Pond #1 (Coastal Plain)"]
["15.c. Wet Pond #2",null,"15.c. Wet Pond #2",null,null,null,"15.c. Wet Pond #2",null,null,"15.c. Wet Pond #2",null,"15.c. Wet Pond #2"]
["15.d. Wet Pond #2 (Coastal Plain)",null,"15.d. Wet Pond #2 (Coastal Plain)",null,null,null,"15.d. Wet Pond #2 (Coastal Plain)",null,null,"15.d. Wet Pond #2 (Coastal Plain)",null,"15.d. Wet Pond #2 (Coastal Plain)"]
["16.a. MTD - Hydrodynamic",null,"16.a. MTD - Hydrodynamic",null,null,null,"16.a. MTD - Hydrodynamic",null,null,"16.a. MTD - Hydrodynamic",null,"16.a. MTD - Hydrodynamic"]
["16.b. MTD - Filtering",null,"16.b. MTD - Filtering",null,null,null,"16.b. MTD - Filtering",null,null,"16.b. MTD - Filtering",null,"16.b. MTD - Filtering"]
["16.c. MTD - Generic",null,"16.c. MTD - Generic",null,null,null,"16.c. MTD - Generic",null,null,"16.c. MTD - Generic",null,"16.c. MTD - Generic"]
[]
[]
[]
["Options for 11 A.  Filtering Practice #1",null,"Options for 11 b.  Filtering Practice #2",null,"Options for 12.a.  Constructed Wetland #1",null,"Options for 12.b.  Constructed Wetland #2",null,null,"Options for 13.a.  Wet Pond #1",null,"Options for 13.b.  Wet Pond #1 (Coastal Plain)"]
[null,null,null,null,null,null,null,null,null,{"$f":"P135","v":"None"},null,{"$f":"P135","v":"None"}]
[{"$f":"P135","v":"None"},null,{"$f":"P135","v":"None"},null,{"$f":"P135","v":"None"},null,{"$f":"P135","v":"None"},null,null,{"$f":"P146","v":"4.a. Grass Channel A/B Soils"},null,{"$f":"P146","v":"4.a. Grass Channel A/B Soils"}]
[{"$f":"P146","v":"4.a. Grass Channel A/B Soils"},null,{"$f":"P146","v":"4.a. Grass Channel A/B Soils"},null,{"$f":"P146","v":"4.a. Grass Channel A/B Soils"},null,{"$f":"P146","v":"4.a. Grass Channel A/B Soils"},null,null,"4.b. Grass Channel C/D Soils",null,"4.b. Grass Channel C/D Soils"]
["4.b. Grass Channel C/D Soils",null,"4.b. Grass Channel C/D Soils",null,"4.b. Grass Channel C/D Soils",null,"4.b. Grass Channel C/D Soils",null,null,"4.c. Grass Channel Compost Amended Soils",null,"4.c. Grass Channel Compost Amended Soils"]
["4.c. Grass Channel Compost Amended Soils",null,"4.c. Grass Channel Compost Amended Soils",null,"4.c. Grass Channel Compost Amended Soils",null,"4.c. Grass Channel Compost Amended Soils",null,null,"5.a. Dry Swale #1",null,"5.a. Dry Swale #1"]
["5.a. Dry Swale #1",null,"5.a. Dry Swale #1",null,"5.a. Dry Swale #1",null,"5.a. Dry Swale #1",null,null,"5.b. Dry Swale #2",null,"5.b. Dry Swale #2"]
["5.b. Dry Swale #2",null,"5.b. Dry Swale #2",null,"5.b. Dry Swale #2",null,"5.b. Dry Swale #2",null,null,"6.a. Bioretention #1",null,"6.a. Bioretention #1"]
["6.a. Bioretention #1",null,"6.a. Bioretention #1",null,"6.a. Bioretention #1",null,"6.a. Bioretention #1",null,null,"6.b. Bioretention #2",null,"6.b. Bioretention #2"]
["6.b. Bioretention #2",null,"6.b. Bioretention #2",null,"6.b. Bioretention #2",null,"6.b. Bioretention #2",null,null,"7.a. Infiltration #1",null,"7.a. Infiltration #1"]
["7.a. Infiltration #1",null,"7.a. Infiltration #1",null,"7.a. Infiltration #1",null,"7.a. Infiltration #1",null,null,"7.b. Infiltration #2",null,"7.b. Infiltration #2"]
["7.b. Infiltration #2",null,"7.b. Infiltration #2",null,"7.b. Infiltration #2",null,"7.b. Infiltration #2",null,null,"8.a. ED #1",null,"8.a. ED #1"]
["8.a. ED #1",null,"8.a. ED #1",null,"8.a. ED #1",null,"8.a. ED #1",null,null,"8.b. ED #2",null,"8.b. ED #2"]
["8.b. ED #2",null,"8.b. ED #2",null,"8.b. ED #2",null,"8.b. ED #2",null,null,"9.a. Sheetflow to A/B Soil Conservation Area ",null,"9.a. Sheetflow to A/B Soil Conservation Area "]
["9.a. Sheetflow to A/B Soil Conservation Area ",null,"9.a. Sheetflow to A/B Soil Conservation Area ",null,"9.a. Sheetflow to A/B Soil Conservation Area ",null,"9.a. Sheetflow to A/B Soil Conservation Area ",null,null,"9.b. Sheetflow to C/D Soil Conservation Area",null,"9.b. Sheetflow to C/D Soil Conservation Area"]
["9.b. Sheetflow to C/D Soil Conservation Area",null,"9.b. Sheetflow to C/D Soil Conservation Area",null,"9.b. Sheetflow to C/D Soil Conservation Area",null,"9.b. Sheetflow to C/D Soil Conservation Area",null,null,"9.c. Sheetflow to Vegetated Filter Strip",null,"9.c. Sheetflow to Vegetated Filter Strip"]
["9.c. Sheetflow to Vegetated Filter Strip",null,"9.c. Sheetflow to Vegetated Filter Strip",null,"9.c. Sheetflow to Vegetated Filter Strip",null,"9.c. Sheetflow to Vegetated Filter Strip",null,null,"10.a. Regenerative Stormwater Conveyance #1",null,"10.a. Regenerative Stormwater Conveyance #1"]
[{"$f":"P165","v":"12.a. Wet Swale #1"},null,"10.a. Regenerative Stormwater Conveyance #1",null,"10.a. Regenerative Stormwater Conveyance #1",null,"10.a. Regenerative Stormwater Conveyance #1",null,null,"10.b. Regenerative Stormwater Conveyance #2",null,"10.b. Regenerative Stormwater Conveyance #2"]
[{"$f":"P166","v":"12.b. Wet Swale #2"},null,"10.b. Regenerative Stormwater Conveyance #2",null,"10.b. Regenerative Stormwater Conveyance #2",null,"10.b. Regenerative Stormwater Conveyance #2",null,null,{"$f":"P165","v":"12.a. Wet Swale #1"},null,{"$f":"P165","v":"12.a. Wet Swale #1"}]
[{"$f":"P168","v":"13.b. Filtering Practice #2"},null,{"$f":"P165","v":"12.a. Wet Swale #1"},null,{"$f":"P165","v":"12.a. Wet Swale #1"},null,{"$f":"P165","v":"12.a. Wet Swale #1"},null,null,"12.b. Wet Swale #2",null,"12.b. Wet Swale #2"]
["14.a. Constructed Wetland #1",null,{"$f":"P166","v":"12.b. Wet Swale #2"},null,{"$f":"P166","v":"12.b. Wet Swale #2"},null,{"$f":"P166","v":"12.b. Wet Swale #2"},null,null,"13.a. Filtering Practice #1",null,"13.a. Filtering Practice #1"]
["14.b. Constructed Wetland #2",null,{"$f":"P167","v":"13.a. Filtering Practice #1"},null,{"$f":"P167","v":"13.a. Filtering Practice #1"},null,{"$f":"P167","v":"13.a. Filtering Practice #1"},null,null,"13.b. Filtering Practice #2",null,"13.b. Filtering Practice #2"]
["15.a. Wet Pond #1",null,{"$f":"P169","v":"14.a. Constructed Wetland #1"},null,{"$f":"P168","v":"13.b. Filtering Practice #2"},null,{"$f":"P168","v":"13.b. Filtering Practice #2"},null,null,"14.a. Constructed Wetland #1",null,"14.a. Constructed Wetland #1"]
["15.b. Wet Pond #1 (Coastal Plain)",null,"14.b. Constructed Wetland #2",null,{"$f":"P170","v":"14.b. Constructed Wetland #2"},null,{"$f":"P169","v":"14.a. Constructed Wetland #1"},null,null,"14.b. Constructed Wetland #2",null,"14.b. Constructed Wetland #2"]
["15.c. Wet Pond #2",null,"15.a. Wet Pond #1",null,"15.a. Wet Pond #1",null,{"$f":"P171","v":"15.a. Wet Pond #1"},null,null,{"$f":"P173","v":"15.c. Wet Pond #2"},null,{"$f":"P174","v":"15.d. Wet Pond #2 (Coastal Plain)"}]
["15.d. Wet Pond #2 (Coastal Plain)",null,"15.b. Wet Pond #1 (Coastal Plain)",null,"15.b. Wet Pond #1 (Coastal Plain)",null,"15.b. Wet Pond #1 (Coastal Plain)",null,null,{"$f":"P175","v":"16.a. MTD - Hydrodynamic"},null,{"$f":"P175","v":"16.a. MTD - Hydrodynamic"}]
["16.a. MTD - Hydrodynamic",null,"15.c. Wet Pond #2",null,"15.c. Wet Pond #2",null,"15.c. Wet Pond #2",null,null,{"$f":"P176","v":"16.b. MTD - Filtering"},null,{"$f":"P176","v":"16.b. MTD - Filtering"}]
["16.b. MTD - Filtering",null,"15.d. Wet Pond #2 (Coastal Plain)",null,"15.d. Wet Pond #2 (Coastal Plain)",null,"15.d. Wet Pond #2 (Coastal Plain)",null,null,{"$f":"P177","v":"16.c. MTD - Generic"},null,{"$f":"P177","v":"16.c. MTD - Generic"}]
["16.c. MTD - Generic",null,"16.a. MTD - Hydrodynamic",null,"16.a. MTD - Hydrodynamic",null,"16.a. MTD - Hydrodynamic"]
[null,null,"16.b. MTD - Filtering",null,"16.b. MTD - Filtering",null,"16.b. MTD - Filtering"]
[null,null,"16.c. MTD - Generic",null,"16.c. MTD - Generic",null,"16.c. MTD - Generic"]
[]
[]
[]
["Options for 13.c.  Wet Pond #2",null,"Options for 13.d.  Wet Pond #2 (Coastal Plain)",null,"Options for 14.a.  Manufactured Device-Hydrodynamic",null,"Options for 14.b.  Manufactured Device-Filtering",null,null,null,"Options for 14.c.  Manufactured Device-Generic"]
[]
[{"$f":"P135","v":"None"},null,{"$f":"P135","v":"None"},null,{"$f":"P135","v":"None"},null,{"$f":"P135","v":"None"},null,null,null,{"$f":"P135","v":"None"}]
[{"$f":"P146","v":"4.a. Grass Channel A/B Soils"},null,{"$f":"P146","v":"4.a. Grass Channel A/B Soils"},null,{"$f":"P146","v":"4.a. Grass Channel A/B Soils"},null,{"$f":"P146","v":"4.a. Grass Channel A/B Soils"},null,null,null,{"$f":"P146","v":"4.a. Grass Channel A/B Soils"}]
["4.b. Grass Channel C/D Soils",null,"4.b. Grass Channel C/D Soils",null,"4.b. Grass Channel C/D Soils",null,"4.b. Grass Channel C/D Soils",null,null,null,"4.b. Grass Channel C/D Soils"]
["4.c. Grass Channel Compost Amended Soils",null,"4.c. Grass Channel Compost Amended Soils",null,"4.c. Grass Channel Compost Amended Soils",null,"4.c. Grass Channel Compost Amended Soils",null,null,null,"4.c. Grass Channel Compost Amended Soils"]
["5.a. Dry Swale #1",null,"5.a. Dry Swale #1",null,"5.a. Dry Swale #1",null,"5.a. Dry Swale #1",null,null,null,"5.a. Dry Swale #1"]
["5.b. Dry Swale #2",null,"5.b. Dry Swale #2",null,"5.b. Dry Swale #2",null,"5.b. Dry Swale #2",null,null,null,"5.b. Dry Swale #2"]
["6.a. Bioretention #1",null,"6.a. Bioretention #1",null,"6.a. Bioretention #1",null,"6.a. Bioretention #1",null,null,null,"6.a. Bioretention #1"]
["6.b. Bioretention #2",null,"6.b. Bioretention #2",null,"6.b. Bioretention #2",null,"6.b. Bioretention #2",null,null,null,"6.b. Bioretention #2"]
["7.a. Infiltration #1",null,"7.a. Infiltration #1",null,"7.a. Infiltration #1",null,"7.a. Infiltration #1",null,null,null,"7.a. Infiltration #1"]
["7.b. Infiltration #2",null,"7.b. Infiltration #2",null,"7.b. Infiltration #2",null,"7.b. Infiltration #2",null,null,null,"7.b. Infiltration #2"]
["8.a. ED #1",null,"8.a. ED #1",null,"8.a. ED #1",null,"8.a. ED #1",null,null,null,"8.a. ED #1"]
["8.b. ED #2",null,"8.b. ED #2",null,"8.b. ED #2",null,"8.b. ED #2",null,null,null,"8.b. ED #2"]
["9.a. Sheetflow to A/B Soil Conservation Area ",null,"9.a. Sheetflow to A/B Soil Conservation Area ",null,"9.a. Sheetflow to A/B Soil Conservation Area ",null,"9.a. Sheetflow to A/B Soil Conservation Area ",null,null,null,"9.a. Sheetflow to A/B Soil Conservation Area "]
["9.b. Sheetflow to C/D Soil Conservation Area",null,"9.b. Sheetflow to C/D Soil Conservation Area",null,"9.b. Sheetflow to C/D Soil Conservation Area",null,"9.b. Sheetflow to C/D Soil Conservation Area",null,null,null,"9.b. Sheetflow to C/D Soil Conservation Area"]
["9.c. Sheetflow to Vegetated Filter Strip",null,"9.c. Sheetflow to Vegetated Filter Strip",null,"9.c. Sheetflow to Vegetated Filter Strip",null,"9.c. Sheetflow to Vegetated Filter Strip",null,null,null,"9.c. Sheetflow to Vegetated Filter Strip"]
["10.a. Regenerative Stormwater Conveyance #1",null,"10.a. Regenerative Stormwater Conveyance #1",null,"10.a. Regenerative Stormwater Conveyance #1",null,"10.a. Regenerative Stormwater Conveyance #1",null,null,null,"10.a. Regenerative Stormwater Conveyance #1"]
["10.b. Regenerative Stormwater Conveyance #2",null,"10.b. Regenerative Stormwater Conveyance #2",null,"10.b. Regenerative Stormwater Conveyance #2",null,"10.b. Regenerative Stormwater Conveyance #2",null,null,null,"10.b. Regenerative Stormwater Conveyance #2"]
[{"$f":"P165","v":"12.a. Wet Swale #1"},null,{"$f":"P165","v":"12.a. Wet Swale #1"},null,{"$f":"P165","v":"12.a. Wet Swale #1"},null,{"$f":"P165","v":"12.a. Wet Swale #1"},null,null,null,{"$f":"P165","v":"12.a. Wet Swale #1"}]
["12.b. Wet Swale #2",null,"12.b. Wet Swale #2",null,"12.b. Wet Swale #2",null,"12.b. Wet Swale #2",null,null,null,"12.b. Wet Swale #2"]
["13.a. Filtering Practice #1",null,"13.a. Filtering Practice #1",null,"13.a. Filtering Practice #1",null,"13.a. Filtering Practice #1",null,null,null,"13.a. Filtering Practice #1"]
["13.b. Filtering Practice #2",null,"13.b. Filtering Practice #2",null,"13.b. Filtering Practice #2",null,"13.b. Filtering Practice #2",null,null,null,"13.b. Filtering Practice #2"]
["14.a. Constructed Wetland #1",null,"14.a. Constructed Wetland #1",null,"14.a. Constructed Wetland #1",null,"14.a. Constructed Wetland #1",null,null,null,"14.a. Constructed Wetland #1"]
["14.b. Constructed Wetland #2",null,"14.b. Constructed Wetland #2",null,"14.b. Constructed Wetland #2",null,"14.b. Constructed Wetland #2",null,null,null,"14.b. Constructed Wetland #2"]
["15.a. Wet Pond #1",null,{"$f":"P172","v":"15.b. Wet Pond #1 (Coastal Plain)"},null,"15.a. Wet Pond #1",null,"15.a. Wet Pond #1",null,null,null,"15.a. Wet Pond #1"]
[{"$f":"P175","v":"16.a. MTD - Hydrodynamic"},null,{"$f":"P175","v":"16.a. MTD - Hydrodynamic"},null,"15.b. Wet Pond #1 (Coastal Plain)",null,"15.b. Wet Pond #1 (Coastal Plain)",null,null,null,"15.b. Wet Pond #1 (Coastal Plain)"]
[{"$f":"P176","v":"16.b. MTD - Filtering"},null,{"$f":"P176","v":"16.b. MTD - Filtering"},null,"15.c. Wet Pond #2",null,"15.c. Wet Pond #2",null,null,null,"15.c. Wet Pond #2"]
[{"$f":"P177","v":"16.c. MTD - Generic"},null,{"$f":"P177","v":"16.c. MTD - Generic"},null,"15.d. Wet Pond #2 (Coastal Plain)",null,"15.d. Wet Pond #2 (Coastal Plain)",null,null,null,"15.d. Wet Pond #2 (Coastal Plain)"]
[null,null,null,null,{"$f":"P176","v":"16.b. MTD - Filtering"}]
[]
[]
[]
["Options for 10.a. Regenerative Stormwater Conveyance #1",null,"Options for 10.b. Regenerative Stormwater Conveyance #1",null,null,null,"Options for 11.a. Trees over Pervious, A/B",null,null,null,"Options for 11.b. Trees over Pervious, C/D",null,null,"Options for 11.c. Trees over Impervious"]
[]
[{"$f":"P135","v":"None"},null,{"$f":"P135","v":"None"},null,null,null,{"$f":"P135","v":"None"},null,null,null,{"$f":"P135","v":"None"},null,null,{"$f":"P135","v":"None"}]
[null,null,null,null,null,null,{"$f":"P146","v":"4.a. Grass Channel A/B Soils"},null,null,null,{"$f":"P146","v":"4.a. Grass Channel A/B Soils"},null,null,{"$f":"P146","v":"4.a. Grass Channel A/B Soils"}]
[null,null,null,null,null,null,{"$f":"P147","v":"4.b. Grass Channel C/D Soils"},null,null,null,{"$f":"P147","v":"4.b. Grass Channel C/D Soils"},null,null,{"$f":"P147","v":"4.b. Grass Channel C/D Soils"}]
[null,null,null,null,null,null,{"$f":"P148","v":"4.c. Grass Channel Compost Amended Soils"},null,null,null,{"$f":"P148","v":"4.c. Grass Channel Compost Amended Soils"},null,null,"4.c. Grass Channel Compost Amended Soils"]
[null,null,null,null,null,null,"5.a. Dry Swale #1",null,null,null,"5.a. Dry Swale #1",null,null,"5.a. Dry Swale #1"]
[null,null,null,null,null,null,"5.b. Dry Swale #2",null,null,null,"5.b. Dry Swale #2",null,null,"5.b. Dry Swale #2"]
[null,null,null,null,null,null,"6.a. Bioretention #1",null,null,null,"6.a. Bioretention #1",null,null,"6.a. Bioretention #1"]
[null,null,null,null,null,null,"6.b. Bioretention #2",null,null,null,"6.b. Bioretention #2",null,null,"6.b. Bioretention #2"]
[null,null,null,null,null,null,"7.a. Infiltration #1",null,null,null,"7.a. Infiltration #1",null,null,"7.a. Infiltration #1"]
[null,null,null,null,null,null,"7.b. Infiltration #2",null,null,null,"7.b. Infiltration #2",null,null,"7.b. Infiltration #2"]
[null,null,null,null,null,null,"8.a. ED #1",null,null,null,"8.a. ED #1",null,null,"8.a. ED #1"]
[null,null,null,null,null,null,"8.b. ED #2",null,null,null,"8.b. ED #2",null,null,"8.b. ED #2"]
[null,null,null,null,null,null,"9.a. Sheetflow to A/B Soil Conservation Area ",null,null,null,"9.a. Sheetflow to A/B Soil Conservation Area ",null,null,"9.a. Sheetflow to A/B Soil Conservation Area "]
[null,null,null,null,null,null,"9.b. Sheetflow to C/D Soil Conservation Area",null,null,null,"9.b. Sheetflow to C/D Soil Conservation Area",null,null,"9.b. Sheetflow to C/D Soil Conservation Area"]
[null,null,null,null,null,null,"9.c. Sheetflow to Vegetated Filter Strip",null,null,null,"9.c. Sheetflow to Vegetated Filter Strip",null,null,"9.c. Sheetflow to Vegetated Filter Strip"]
[null,null,null,null,null,null,"10.a. Regenerative Stormwater Conveyance #1",null,null,null,"10.a. Regenerative Stormwater Conveyance #1",null,null,"10.a. Regenerative Stormwater Conveyance #1"]
[null,null,null,null,null,null,"10.b. Regenerative Stormwater Conveyance #2",null,null,null,"10.b. Regenerative Stormwater Conveyance #2",null,null,"10.b. Regenerative Stormwater Conveyance #2"]
[null,null,null,null,null,null,{"$f":"P165","v":"12.a. Wet Swale #1"},null,null,null,{"$f":"P165","v":"12.a. Wet Swale #1"},null,null,{"$f":"P165","v":"12.a. Wet Swale #1"}]
[null,null,null,null,null,null,{"$f":"P166","v":"12.b. Wet Swale #2"},null,null,null,{"$f":"P166","v":"12.b. Wet Swale #2"},null,null,{"$f":"P166","v":"12.b. Wet Swale #2"}]
[null,null,null,null,null,null,{"$f":"P167","v":"13.a. Filtering Practice #1"},null,null,null,{"$f":"P167","v":"13.a. Filtering Practice #1"},null,null,"13.a. Filtering Practice #1"]
[null,null,null,null,null,null,"13.b. Filtering Practice #2",null,null,null,"13.b. Filtering Practice #2",null,null,"13.b. Filtering Practice #2"]
[null,null,null,null,null,null,"14.a. Constructed Wetland #1",null,null,null,"14.a. Constructed Wetland #1",null,null,"14.a. Constructed Wetland #1"]
[null,null,null,null,null,null,"14.b. Constructed Wetland #2",null,null,null,"14.b. Constructed Wetland #2",null,null,"14.b. Constructed Wetland #2"]
[null,null,null,null,null,null,"15.a. Wet Pond #1",null,null,null,"15.a. Wet Pond #1",null,null,"15.a. Wet Pond #1"]
[null,null,null,null,null,null,"15.b. Wet Pond #1 (Coastal Plain)",null,null,null,"15.b. Wet Pond #1 (Coastal Plain)",null,null,"15.b. Wet Pond #1 (Coastal Plain)"]
[null,null,null,null,null,null,"15.c. Wet Pond #2",null,null,null,"15.c. Wet Pond #2",null,null,"15.c. Wet Pond #2"]
[null,null,null,null,null,null,"15.d. Wet Pond #2 (Coastal Plain)",null,null,null,"15.d. Wet Pond #2 (Coastal Plain)",null,null,"15.d. Wet Pond #2 (Coastal Plain)"]
[null,null,null,null,null,null,"16.a. MTD - Hydrodynamic",null,null,null,"16.a. MTD - Hydrodynamic",null,null,"16.a. MTD - Hydrodynamic"]
[null,null,null,null,null,null,"16.b. MTD - Filtering",null,null,null,"16.b. MTD - Filtering",null,null,"16.b. MTD - Filtering"]
[null,null,null,null,null,null,"16.c. MTD - Generic",null,null,null,"16.c. MTD - Generic",null,null,"16.c. MTD - Generic"]

{"sheet":"Water Quality Compliance","index":8,"n_rows":33,"n_cols":23,"rows_kept":33,"cut":false,"hidden":false,"merged":[[27,4,28,7],[28,0,28,2],[16,21,16,22]]}
["Site Results (Water Quality Compliance) VRRM 4.1, 2024",null,null,null,null,null,null,null,null,null,null,null,null,null,null,null,null,null,null,"error summary"]
["Area Checks","D.A. A","D.A. B","D.A. C","D.A. D","D.A. E","AREA CHECK",null,null,null,null,null,null,null,null,null,null,null,null,"Area checks",{"$f":"COUNTIF(G8:G9,\"AREA EXCEEDED!\")","v":0}]
["FOREST (ac)",{"$f":"'D.A. A'!$F$5","v":0},{"$f":"'D.A. B'!$F$5","v":0},{"$f":"'D.A. C'!$F$5","v":0},{"$f":"'D.A. D'!$F$5","v":0},{"$f":"'D.A. E'!$F$5","v":0},{"$f":"IF(SUM(B3:F3)>Site!$F$25,\"AREA EXCEEDED!\",\"OK.\")","v":"OK."},null,null,null,null,null,null,null,null,null,null,null,null,"DA checks",{"$f":"COUNTIF(G9:G10,\"AREA EXCEEDED!\")","v":0}]
["MIXED OPEN (ac)",{"$f":"'D.A. A'!$F$6","v":0},{"$f":"'D.A. B'!$F$6","v":0},{"$f":"'D.A. C'!$F$6","v":0},{"$f":"'D.A. D'!$F$6","v":0},{"$f":"'D.A. E'!$F$6","v":0},{"$f":"IF(SUM(B4:F4)>Site!$F$26,\"AREA EXCEEDED!\",\"OK.\")","v":"OK."}]
["MIXED OPEN AREA TREATED(ac)",{"$f":"'D.A. A'!$F$108","v":0},{"$f":"'D.A. B'!$F$108","v":0},{"$f":"'D.A. C'!$F$108","v":0},{"$f":"'D.A. D'!$F$108","v":0},{"$f":"'D.A. E'!$F$108","v":0},{"$f":"IF(SUM(B5:F5)>SUM('D.A. A'!$F$6,'D.A. B'!$F$6,'D.A. C'!$F$6,'D.A. D'!$F$6,'D.A. E'!$F$6),\"AREA EXCEEDED!\",\"OK.\")","v":"OK."}]
["MANAGED TURF AREA (ac)",{"$f":"'D.A. A'!$F$7","v":0},{"$f":"'D.A. B'!$F$7","v":0},{"$f":"'D.A. C'!$F$7","v":0},{"$f":"'D.A. D'!$F$7","v":0},{"$f":"'D.A. E'!$F$7","v":0},{"$f":"IF(SUM(B6:F6)>Site!$F$27,\"AREA EXCEEDED!\",\"OK.\")","v":"OK."}]
["MANAGED TURF AREA TREATED (ac)",{"$f":"'D.A. A'!$F$109","v":0},{"$f":"'D.A. B'!$F$109","v":0},{"$f":"'D.A. C'!$F$109","v":0},{"$f":"'D.A. D'!$F$109","v":0},{"$f":"'D.A. E'!$F$109","v":0},{"$f":"IF(SUM(B7:F7)>SUM('D.A. A'!$F$7,'D.A. B'!$F$7,'D.A. C'!$F$7,'D.A. D'!$F$7,'D.A. E'!$F$7),\"AREA EXCEEDED!\",\"OK.\")","v":"OK."}]
["IMPERVIOUS COVER (ac)",{"$f":"'D.A. A'!$F$8","v":0},{"$f":"'D.A. B'!$F$8","v":0},{"$f":"'D.A. C'!$F$8","v":0},{"$f":"'D.A. D'!$F$8","v":0},{"$f":"'D.A. E'!$F$8","v":0},{"$f":"IF(SUM(B8:F8)>Site!$F$28,\"AREA EXCEEDED!\",\"OK.\")","v":"OK."},null,null,null,null,null,null,null,null,null,null,null,null,"total",{"$f":"SUM(U2:U3)","v":0}]
["IMPERVIOUS COVER TREATED (ac)",{"$f":"'D.A. A'!$F$107","v":0},{"$f":"'D.A. B'!$F$107","v":0},{"$f":"'D.A. C'!$F$107","v":0},{"$f":"'D.A. D'!$F$107","v":0},{"$f":"'D.A. E'!$F$107","v":0},{"$f":"IF(SUM(B9:F9)>SUM('D.A. A'!$F$8,'D.A. B'!$F$8,'D.A. C'!$F$8,'D.A. D'!$F$8,'D.A. E'!$F$8),\"AREA EXCEEDED!\",\"OK.\")","v":"OK."}]
["AREA CHECK  ",{"$f":"IF(B9>B8,\"AREA EXCEEDED!\",IF(B7>B6,\"AREA EXCEEDED!\",\"OK.\"))","v":"OK."},{"$f":"IF(C9>C8,\"AREA EXCEEDED!\",IF(C7>C6,\"AREA EXCEEDED!\",\"OK.\"))","v":"OK."},{"$f":"IF(D9>D8,\"AREA EXCEEDED!\",IF(D7>D6,\"AREA EXCEEDED!\",\"OK.\"))","v":"OK."},{"$f":"IF(E9>E8,\"AREA EXCEEDED!\",IF(E7>E6,\"AREA EXCEEDED!\",\"OK.\"))","v":"OK."},{"$f":"IF(F9>F8,\"AREA EXCEEDED!\",IF(F7>F6,\"AREA EXCEEDED!\",\"OK.\"))","v":"OK."}]
[null,null,null,null,null,{"$f":"IF(COUNTIF(B8:F8,\"=ERROR!\")>0,\"ERROR!: CHECK SITE DATA TAB\",IF(COUNTIF(B6:F6,\"=ERROR!\")>0,\"ERROR!: CHECK SITE DATA TAB\",\"\"))","v":""}]
["Site Treatment Volume (ft3)",{"$f":"Site!$F$64","v":"--"},{"$f":"IF(B12=\"x\",\"Check Site tab for errors!\",\"\")","v":""}]
[]
["Runoff Reduction Volume and TP By Drainage Area"]
[null,"D.A. A","D.A. B","D.A. C","D.A. D","D.A. E","TOTAL"]
["RUNOFF REDUCTION VOLUME ACHIEVED (ft3)",{"$f":"'D.A. A'!$F$71","v":0},{"$f":"'D.A. B'!$F$71","v":0},{"$f":"'D.A. C'!$F$71","v":0},{"$f":"'D.A. D'!$F$71","v":0},{"$f":"'D.A. E'!$F$71","v":0},{"$f":"SUM(B16:F16)","v":0}]
["TP LOAD AVAILABLE FOR REMOVAL  (lb/yr)",{"$f":"'D.A. A'!$N$8","v":0},{"$f":"'D.A. B'!$N$8","v":0},{"$f":"'D.A. C'!$N$8","v":0},{"$f":"'D.A. D'!$N$8","v":0},{"$f":"'D.A. E'!$N$8","v":0},{"$f":"SUM(B17:F17)","v":0},null,null,null,null,null,null,null,null,null,null,null,null,null,null,"Project:"]
["TP LOAD REDUCTION ACHIEVED  (lb/yr)",{"$f":"'D.A. A'!$I$116","v":0},{"$f":"'D.A. B'!$I$116","v":0},{"$f":"'D.A. C'!$I$116","v":0},{"$f":"'D.A. D'!$I$116","v":0},{"$f":"'D.A. E'!$I$116","v":0},{"$f":"SUM(B18:F18)","v":0},null,null,null,null,null,null,null,null,null,null,null,null,"Reduction",null,"Regular","Linear"]
["TP LOAD REMAINING  (lb/yr)",{"$f":"B17-B18","v":0},{"$f":"C17-C18","v":0},{"$f":"D17-D18","v":0},{"$f":"E17-E18","v":0},{"$f":"F17-F18","v":0},{"$f":"SUM(B19:F19)","v":0},null,null,null,null,null,null,null,null,null,null,null,null,"required",null,{"$f":"B25","v":"--"},{"$f":"D25","v":""}]
[null,null,null,null,null,null,null,null,null,null,null,null,null,null,null,null,null,null,null,"achieved",null,{"$f":"B26","v":"--"},{"$f":"D26","v":""}]
["NITROGEN LOAD REDUCTION ACHIEVED  (lb/yr)",{"$f":"'D.A. A'!$I$123","v":0},{"$f":"'D.A. B'!$I$123","v":0},{"$f":"'D.A. C'!$I$123","v":0},{"$f":"'D.A. D'!$I$123","v":0},{"$f":"'D.A. E'!$I$123","v":0},{"$f":"SUM(B21:F21)","v":0}]
[null,null,null,null,null,null,null,null,null,null,null,null,null,null,null,null,null,null,null,"req-ach",null,{"$f":"V19-V20","v":{"$error":"#VALUE!"}},{"$f":"W19-W20","v":{"$error":"#VALUE!"}}]
["Total Phosphorus  ",null,null,"LINEAR PROJECT:",null,null,null,null,null,null,null,null,null,null,null,null,null,null,null,"req>ach?",null,{"$f":"V19>V20","v":false},{"$f":"W19>W20","v":false}]
["FINAL POST-DEVELOPMENT TP LOAD (lb/yr)",{"$f":"IF(Site!$E$6=\"yes\",\"--\",Site!$F$65)","v":"--"},null,{"$f":"IF(Site!$E$6=\"yes\",Site!$F$65,\"\")","v":""},null,null,null,null,null,null,null,null,null,null,null,null,null,null,null,"abs(req-ach)>=0.005?",null,{"$f":"ABS(V19-V20)>=0.005","v":{"$error":"#VALUE!"}},{"$f":"ABS(W19-W20)>=0.005","v":{"$error":"#VALUE!"}}]
["TP LOAD REDUCTION REQUIRED (lb/yr)",{"$f":"IF(OR(Site!$E$6=\"yes\",$B$24=\"--\"),\"--\",IF(OR(Site!$P$5>0,$U$8>0),\"x\",Site!$G$33))","v":"--"},null,{"$f":"IF(OR($D$24=\"\",$D$24=\"--\"),$D$24,IF(OR(Site!$P$5>0,$U$8>0),\"x\",Site!$G$33))","v":""}]
["TP LOAD REDUCTION ACHIEVED  (lb/yr)",{"$f":"IF(OR($B$25=\"--\",$B$25=\"x\"),$B$25,$G$18)","v":"--"},null,{"$f":"IF($D$24=\"\", $D$24,IF(OR($D$25=\"--\",$D$25=\"x\"),$D$25,$G$18))","v":""}]
["TP LOAD REMAINING (lb/yr):",{"$f":"IF(OR($B$25=\"--\",$B$25=\"x\"),$B$25,$B$24-$B$26)","v":"--"},null,{"$f":"IF($D$24=\"\",$D$24,IF(OR($D$25=\"--\",$D$25=\"x\"),$D$25,$D$24-$D$26))","v":""},null,null,null,null,null,null,null,null,null,null,null,null,null,null,null,null,null,{"$f":"\"--\"","v":"--"}]
["REMAINING TP LOAD REDUCTION REQUIRED (lb/yr):",{"$f":"IF($B$25=\"--\",\"--\",IF(OR($B$25=\"x\",$G$3=\"AREA EXCEEDED!\"),\"CHECK AREAS!\",IF($B$25>$B$26,$B$25-$B$26,0)))","v":"--"},{"$f":"IF($A$29=\"\",\"\",\"**\")","v":""},{"$f":"IF($D$24=\"\",\"\",IF($D$25=\"--\",\"--\",IF(OR($D$25=\"x\",$G$3=\"AREA EXCEEDED!\"),\"CHECK AREAS!\",IF($D$25>$D$26,$D$25-$D$26,0))))","v":""},{"$f":"IF(OR($D$24=\"\",$D$24=\"--\",D$24=\"x\",$U$8>0),\"\",IF(AND($W$23=TRUE,$W$24=TRUE),\"\",IF(AND($W$23=FALSE,$W$24=FALSE),\"**No further TP load reduction required\",IF(AND($W$23=FALSE,$W$24=TRUE),\"** TARGET TP REDUCTION EXCEEDED BY \"&ROUND($D$26-$D$25,2)&\" LB/YEAR **\",\"**No further TP load reduction required\n(Required - Achieved < 0.005 lb/yr)\"))))","v":""}]
[{"$f":"IF(OR(Site!$E$6=\"yes\",Site!$G$33=\"--\",$B$28=\"CHECK AREAS!\"),\"\",IF(AND($V$23=TRUE,$V$24=TRUE),\"\",IF(AND($V$23=FALSE,$V$24=FALSE),\"**No further TP load reduction required\",IF(AND($V$23=FALSE,$V$24=TRUE),\"** TARGET TP REDUCTION EXCEEDED BY \"&ROUND($B$26-$B$25,2)&\" LB/YEAR **\",\"**No further TP load reduction required \n(Required - Achieved < 0.005 lb/yr)\"))))","v":""}]
["Total Nitrogen (For Information Purposes)"]
["POST-DEVELOPMENT LOAD (lb/yr)",{"$f":"IF(Site!$F$13=\"--\",\"--\",IF(Site!$J$37=Site!$O$2,\"x\",Site!$J$37))","v":"--"}]
["NITROGEN LOAD REDUCTION ACHIEVED  (lb/yr)",{"$f":"IF(OR($B$31=\"--\",$B$31=\"x\"),$B$31,$G$21)","v":"--"}]
["REMAINING POST-DEVELOPMENT NITROGEN LOAD (lb/yr)",{"$f":"IF(OR($B$31=\"--\",$B$31=\"x\"),$B$31,$B$31-$B$32)","v":"--"}]

{"sheet":"Runoff Volume and CN","index":9,"n_rows":666,"n_cols":28,"rows_kept":666,"cut":false,"hidden":false,"merged":[[29,1,30,2],[25,1,26,2],[3,4,3,6],[6,1,6,2],[7,1,7,3],[9,1,11,10],[12,1,15,10],[16,1,17,10],[20,1,20,11],[22,1,22,2],[23,1,24,2],[23,9,24,9],[27,1,28,2],[55,9,56,9],[34,1,34,3],[35,1,35,3],[38,1,38,2],[39,1,40,2],[39,9,40,9],[43,1,44,2],[41,1,42,2],[45,1,46,2],[50,1,50,3],[51,1,51,3],[54,1,54,2],[55,1,56,2],[91,1,92,2],[93,1,94,2],[98,1,98,3],[99,1,99,3],[71,9,72,9],[75,1,76,2],[77,1,78,2],[82,1,82,3],[83,1,83,3],[86,1,86,2],[71,1,72,2],[57,1,58,2],[73,1,74,2],[89,1,90,2],[87,1,88,2],[87,9,88,9],[59,1,60,2],[61,1,62,2],[66,1,66,3],[67,1,67,3],[70,1,70,2]]}
[]
[null,null,null,null,null,"Runoff Volume and Curve Number Calculations, VRRM 4.1, 2024",null,null,null,null,null,null,null,"These values are used for",null,null," Range  :  1               2                 3                4                 5                 6                7  "]
[null,null,null,null,null,null,null,null,null,null,null,null,null,"computing \"qu\" by equation",null,null,"  Ia / P :",0.1,0.3,0.35,0.4,0.45,0.5]
[null,null,null,null,"Enter design storm rainfall depths (in):",null,null,null,null,null,null,null,null,"in Appendix F of TR-55.",null,null,"C0 :",2.5532300000000001,2.4653200000000002,2.4189600000000002,2.36409,2.2923800000000001,2.20282]
[null,null,null,null,"1-year storm","2-year storm","10-year storm",null,null,null,null,null,null,"The formulas automatically",null,null,"C1 :",-0.61512,-0.62256999999999996,-0.61594000000000004,-0.59857000000000005,-0.57004999999999995,-0.51598999999999995]
[null,null,null,{"$f":"IF(SUM(E6:G6)=0,\"→\",\"\")","v":"→"},0,0,0,{"$f":"IF(SUM(E6:G6)=0,\"←\",\"\")","v":"←"},null,null,null,null,null,"interpolate for C0, C1 & C2.",null,null,"C2 :",-0.16403000000000001,-0.11656999999999999,-8.8200000000000001E-2,-5.6210000000000003E-2,-2.281E-2,-1.259E-2]
[]
[]
[null,"*Notes (see below):"]
[null,"[1] The curve numbers and runoff volumes computed in this spreadsheet for each drainage area are limited in their applicability for determining and demonstrating compliance with water quantity requirements. See VRRM User's Guide and Documentation for additional information."]
[]
[]
[null,"[2] Runoff Volume (RV) for pre- and post-development drainage areas must be in volumetric units (e.g., acre-feet or cubic feet) when using the Energy Balance Equation. Runoff measured in watershed-inches and shown in the spreadsheet as RV(watershed-inch) can only be used in the Energy Balance Equation when the pre- and post-development drainage areas are equal. Otherwise RV(watershed-inch) must be multiplied by the drainage area."]
[]
[]
[]
[null,"[3] Adjusted CNs are based on runoff reduction volumes as calculated in D.A. tabs. An alternative CN adjustment calculation for Vegetated Roofs is included in BMP specification No. 5."]
[]
[]
[null,null,null,null,null,null,null,null,null,null,null,null,null,"1-year","2-year","10-year"]
[null,"Drainage Area Curve Numbers and Runoff Depths*\nCurve numbers (CN, CNadj) and runoff depths (RVDeveloped) are computed with and without reduction practices.",null,null,null,null,null,null,null,null,null,null,null,"v",null,null,"CN","S"]
[]
[null,"Drainage Area A",null,null,"A Soils","B Soils","C Soils","D Soils",null,"Total Area (acres):",{"$f":"'D.A. A'!$F$9","v":0},null,null,null,{"$f":"IF(F$6>0.2*($R23),(F$6-0.2*($R23))^2/(F$6+0.8*($R23)),0)","v":0},{"$f":"IF(G$6>0.2*($R23),(G$6-0.2*($R23))^2/(G$6+0.8*($R23)),0)","v":0},40,{"$f":"IF(Q23>0,1000/Q23-10,1000)","v":15}]
[null,"Forest -- undisturbed, protected forest or reforested land",null,"Area (acres)",{"$f":"'D.A. A'!$B$5","v":0},{"$f":"'D.A. A'!$C$5","v":0},{"$f":"'D.A. A'!$D$5","v":0},{"$f":"'D.A. A'!$E$5","v":0},null,"Runoff Reduction Volume (ft3):",null,null,null,null,{"$f":"IF(F$6>0.2*($R24),(F$6-0.2*($R24))^2/(F$6+0.8*($R24)),0)","v":0},{"$f":"IF(G$6>0.2*($R24),(G$6-0.2*($R24))^2/(G$6+0.8*($R24)),0)","v":0},{"$f":"Q23+0.1","v":40.1},14.937655860349125]
[null,null,null,"CN",{"$f":"Constants!$H$7","v":30},{"$f":"Constants!$I$7","v":55},{"$f":"Constants!$J$7","v":70},{"$f":"Constants!$K$7","v":77},null,null,{"$f":"'D.A. A'!$F$71","v":0},null,null,null,0,0,40.200000000000003,14.875621890547261]
[null,"Mixed Open -- undisturbed/infrequently maintained grass or shrub land",null,"Area (acres)",{"$f":"'D.A. A'!$B$6","v":0},{"$f":"'D.A. A'!$C$6","v":0},{"$f":"'D.A. A'!$D$6","v":0},{"$f":"'D.A. A'!$E$6","v":0},null,null,null,null,null,null,0,0,40.300000000000004,14.813895781637715]
[null,null,null,"CN",{"$f":"Constants!$H$8","v":34},{"$f":"Constants!$I$8","v":59},{"$f":"Constants!$J$8","v":72},{"$f":"Constants!$K$8","v":79},null,null,null,null,null,null,0,0,40.400000000000006,14.75247524752475]
[null,"Managed Turf -- disturbed, graded for yards or other turf to be mowed/managed",null,"Area (acres)",{"$f":"'D.A. A'!$B$7","v":0},{"$f":"'D.A. A'!$C$7","v":0},{"$f":"'D.A. A'!$D$7","v":0},{"$f":"'D.A. A'!$E$7","v":0},null,null,null,null,null,null,0,0,40.500000000000007,14.691358024691354]
[null,null,null,"CN",{"$f":"Constants!$H$9","v":39},{"$f":"Constants!$I$9","v":61},{"$f":"Constants!$J$9","v":74},{"$f":"Constants!$K$9","v":80},null,null,null,null,null,null,0,0,40.600000000000009,14.630541871921178]
[null,"Impervious Cover ",null,"Area (acres)",{"$f":"'D.A. A'!$B$8","v":0},{"$f":"'D.A. A'!$C$8","v":0},{"$f":"'D.A. A'!$D$8","v":0},{"$f":"'D.A. A'!$E$8","v":0},null,null,null,null,null,null,0,0,40.70000000000001,14.570024570024565]
[null,null,null,"CN",{"$f":"Constants!$H$10","v":98},{"$f":"Constants!$I$10","v":98},{"$f":"Constants!$J$10","v":98},{"$f":"Constants!$K$10","v":98},null,null,null,null,null,null,0,0,40.800000000000011,14.509803921568622]
[null,null,null,null,null,null,null,"CN(D.A. A)",null,null,null,null,null,null,0,0,40.900000000000013,14.44987775061124,null,null,"Drainage Area A:"]
[null,null,null,null,null,null,null,{"$f":"ROUND(IF(K23>0,(SUMPRODUCT(E24:H24,E25:H25)+SUMPRODUCT(E28:H28,E29:H29)+SUMPRODUCT(E26:H26,E27:H27)+SUMPRODUCT(E30:H30,E31:H31))/K23,0),0)","v":0},null,null,null,null,null,null,0,0,41.000000000000014,14.390243902439018]
[null,null,null,null,"1-year storm","2-year storm","10-year storm",null,null,null,null,null,null,null,0,0,41.100000000000016,14.330900243308992,null,null,"S (in)"]
[null,"RVDeveloped (watershed-inch) with no Runoff Reduction*",null,null,{"$f":"IF(E$6>0.2*($U35),(E$6-0.2*($U35))^2/(E$6+0.8*($U35)),0)","v":0},{"$f":"IF(F$6>0.2*($U35),(F$6-0.2*($U35))^2/(F$6+0.8*($U35)),0)","v":0},{"$f":"IF(G$6>0.2*($U35),(G$6-0.2*($U35))^2/(G$6+0.8*($U35)),0)","v":0},null,null,null,null,null,null,null,0,0,41.200000000000017,14.271844660194166,null,null,{"$f":"IF(H33>0,1000/H33-10,1000)","v":1000}]
[null,"RVDeveloped (watershed-inch) with Runoff Reduction*",null,null,{"$f":"IF($K23>0,IF(E35>0,(IFERROR(MAX(E35-$K25/3630/$K23,0),\"Check Areas!\")),E35),E35)","v":0},{"$f":"IF($K23>0,IF(F35>0,(IFERROR(MAX(F35-$K25/3630/$K23,0),\"Check Areas!\")),F35),F35)","v":0},{"$f":"IF($K23>0,IF(G35>0,(IFERROR(MAX(G35-$K25/3630/$K23,0),\"Check Areas!\")),G35),G35)","v":0},null,null,null,null,null,null,null,0,0,41.300000000000018,14.213075060532677]
[null,null,null,"Adjusted CN*",{"$f":"IF($K23>0,VLOOKUP(E36,N$23:$R$676,4),0)","v":0},{"$f":"IF($K23>0,VLOOKUP(F36,O$23:$R$666,3),0)","v":0},{"$f":"IF($K23>0,VLOOKUP(G36,P$23:$R$666,2),0)","v":0},null,null,null,null,null,null,null,0,0,41.40000000000002,14.154589371980666,null,null,null,null,null,null,null,null,null,"….\n"]
[null,null,null,"*See Notes above",null,null,null,null,null,null,null,null,null,null,0,0,41.500000000000021,14.096385542168662]
[null,"Drainage Area B",null,null,"A Soils","B Soils","C Soils","D Soils",null,"Total Area (acres):",{"$f":"'D.A. B'!$F$9","v":0},null,null,null,0,0,41.600000000000023,14.038461538461526]
[null,"Forest -- undisturbed, protected forest or reforested land",null,"Area (acres)",{"$f":"'D.A. B'!$B$5","v":0},{"$f":"'D.A. B'!$C$5","v":0},{"$f":"'D.A. B'!$D$5","v":0},{"$f":"'D.A. B'!$E$5","v":0},null,"Runoff Reduction Volume (ft3):",null,null,null,null,0,0,41.700000000000024,13.980815347721808]
[null,null,null,"CN",{"$f":"Constants!$H$7","v":30},{"$f":"Constants!$I$7","v":55},{"$f":"Constants!$J$7","v":70},{"$f":"Constants!$K$7","v":77},null,null,{"$f":"'D.A. B'!$F$71","v":0},null,null,null,0,0,41.800000000000026,13.923444976076539]
[null,"Mixed Open -- undisturbed/infrequently maintained grass or shrub land",null,"Area (acres)",{"$f":"'D.A. B'!$B$6","v":0},{"$f":"'D.A. B'!$C$6","v":0},{"$f":"'D.A. B'!$D$6","v":0},{"$f":"'D.A. B'!$E$6","v":0},null,null,null,null,null,null,0,0,41.900000000000027,13.866348448687337]
[null,null,null,"CN",{"$f":"Constants!$H$8","v":34},{"$f":"Constants!$I$8","v":59},{"$f":"Constants!$J$8","v":72},{"$f":"Constants!$K$8","v":79},null,null,null,null,null,null,0,0,42.000000000000028,13.809523809523792]
[null,"Managed Turf -- disturbed, graded for yards or other turf to be mowed/managed",null,"Area (acres)",{"$f":"'D.A. B'!$B$7","v":0},{"$f":"'D.A. B'!$C$7","v":0},{"$f":"'D.A. B'!$D$7","v":0},{"$f":"'D.A. B'!$E$7","v":0},null,null,null,null,null,null,0,0,42.10000000000003,13.752969121140126]
[null,null,null,"CN",{"$f":"Constants!$H$9","v":39},{"$f":"Constants!$I$9","v":61},{"$f":"Constants!$J$9","v":74},{"$f":"Constants!$K$9","v":80},null,null,null,null,null,null,0,0,42.200000000000031,13.696682464454959]
[null,"Impervious Cover ",null,"Area (acres)",{"$f":"'D.A. B'!$B$8","v":0},{"$f":"'D.A. B'!$C$8","v":0},{"$f":"'D.A. B'!$D$8","v":0},{"$f":"'D.A. B'!$E$8","v":0},null,null,null,null,null,null,0,0,42.300000000000033,13.640661938534262]
[null,null,null,"CN",{"$f":"Constants!$H$10","v":98},{"$f":"Constants!$I$10","v":98},{"$f":"Constants!$J$10","v":98},{"$f":"Constants!$K$10","v":98},null,null,null,null,null,null,0,0,42.400000000000034,13.584905660377341]
[null,null,null,null,null,null,null,"CN(D.A. B)",null,null,null,null,null,null,0,0,42.500000000000036,13.529411764705863,null,null,"Drainage Area B:"]
[null,null,null,null,null,null,null,{"$f":"ROUND(IF(K39>0,(SUMPRODUCT(E40:H40,E41:H41)+SUMPRODUCT(E44:H44,E45:H45)+SUMPRODUCT(E42:H42,E43:H43)+SUMPRODUCT(E46:H46,E47:H47))/K39,0),0)","v":0},null,null,null,null,null,{"$f":"IF(E$6>0.2*($R49),(E$6-0.2*($R49))^2/(E$6+0.8*($R49)),0)","v":0},0,0,42.600000000000037,13.474178403755847]
[null,null,null,null,"1-year storm","2-year storm","10-year storm",null,null,null,null,null,null,{"$f":"IF(E$6>0.2*($R50),(E$6-0.2*($R50))^2/(E$6+0.8*($R50)),0)","v":0},0,0,42.700000000000038,13.419203747072579,null,null,"S (in)"]
[null,"RVDeveloped (watershed-inch) with no Runoff Reduction*",null,null,{"$f":"IF(E$6>0.2*($U51),(E$6-0.2*($U51))^2/(E$6+0.8*($U51)),0)","v":0},{"$f":"IF(F$6>0.2*($U51),(F$6-0.2*($U51))^2/(F$6+0.8*($U51)),0)","v":0},{"$f":"IF(G$6>0.2*($U51),(G$6-0.2*($U51))^2/(G$6+0.8*($U51)),0)","v":0},null,null,null,null,null,null,0,0,0,42.80000000000004,13.364485981308391,null,null,{"$f":"IF(H49>0,1000/H49-10,1000)","v":1000}]
[null,"RVDeveloped (watershed-inch) with Runoff Reduction*",null,null,{"$f":"IF(E51>0,IF($K39>0,(IFERROR(MAX(E51-$K41/3630/$K39,0),\"Check Areas!\")),E51),E51)","v":0},{"$f":"IF($K39>0,IF(F51>0,(IFERROR(MAX(F51-$K41/3630/$K39,0),\"Check Areas!\")),F51),F51)","v":0},{"$f":"IF($K39>0,IF(G51>0,(IFERROR(MAX(G51-$K41/3630/$K39,0),\"Check Areas!\")),G51),G51)","v":0},null,null,null,null,null,null,0,0,0,42.900000000000041,13.310023310023286]
[null,null,null,"Adjusted CN*",{"$f":"IF($K39>0,VLOOKUP(E52,N$23:$R$676,4),0)","v":0},{"$f":"IF($K39>0,VLOOKUP(F52,O$23:$R$676,3),0)","v":0},{"$f":"IF($K39>0,VLOOKUP(G52,P$23:$R$676,2),0)","v":0},null,null,null,null,null,null,0,0,0,43.000000000000043,13.255813953488349]
[null,null,null,"*See Notes above",null,null,null,null,null,null,null,null,null,0,0,0,43.100000000000044,13.201856148491856]
[null,"Drainage Area C",null,null,"A Soils","B Soils","C Soils","D Soils",null,"Total Area (acres):",{"$f":"'D.A. C'!$F$9","v":0},null,null,0,0,0,43.200000000000045,13.148148148148124]
[null,"Forest -- undisturbed, protected forest or reforested land",null,"Area (acres)",{"$f":"'D.A. C'!$B$5","v":0},{"$f":"'D.A. C'!$C$5","v":0},{"$f":"'D.A. C'!$D$5","v":0},{"$f":"'D.A. C'!$E$5","v":0},null,"Runoff Reduction Volume (ft3):",null,null,null,0,0,0,43.300000000000047,13.094688221708982]
[null,null,null,"CN",{"$f":"Constants!$H$7","v":30},{"$f":"Constants!$I$7","v":55},{"$f":"Constants!$J$7","v":70},{"$f":"Constants!$K$7","v":77},null,null,{"$f":"'D.A. C'!$F$71","v":0},null,null,0,0,0,43.400000000000048,13.041474654377854]
[null,"Mixed Open -- undisturbed/infrequently maintained grass or shrub land",null,"Area (acres)",{"$f":"'D.A. C'!$B$6","v":0},{"$f":"'D.A. C'!$C$6","v":0},{"$f":"'D.A. C'!$D$6","v":0},{"$f":"'D.A. C'!$E$6","v":0},null,null,null,null,null,0,0,0,43.50000000000005,12.98850574712641]
[null,null,null,"CN",{"$f":"Constants!$H$8","v":34},{"$f":"Constants!$I$8","v":59},{"$f":"Constants!$J$8","v":72},{"$f":"Constants!$K$8","v":79},null,null,null,null,null,0,0,0,43.600000000000051,12.935779816513733]
[null,"Managed Turf -- disturbed, graded for yards or other turf to be mowed/managed",null,"Area (acres)",{"$f":"'D.A. C'!$B$7","v":0},{"$f":"'D.A. C'!$C$7","v":0},{"$f":"'D.A. C'!$D$7","v":0},{"$f":"'D.A. C'!$E$7","v":0},null,null,null,null,null,0,0,0,43.700000000000053,12.88329519450798]
[null,null,null,"CN",{"$f":"Constants!$H$9","v":39},{"$f":"Constants!$I$9","v":61},{"$f":"Constants!$J$9","v":74},{"$f":"Constants!$K$9","v":80},null,null,null,null,null,0,0,0,43.800000000000054,12.831050228310474]
[null,"Impervious Cover ",null,"Area (acres)",{"$f":"'D.A. C'!$B$8","v":0},{"$f":"'D.A. C'!$C$8","v":0},{"$f":"'D.A. C'!$D$8","v":0},{"$f":"'D.A. C'!$E$8","v":0},null,null,null,null,null,0,0,0,43.900000000000055,12.779043280182204]
[null,null,null,"CN",{"$f":"Constants!$H$10","v":98},{"$f":"Constants!$I$10","v":98},{"$f":"Constants!$J$10","v":98},{"$f":"Constants!$K$10","v":98},null,null,null,null,null,0,0,0,44.000000000000057,12.727272727272698]
[null,null,null,null,null,null,null,"CN(D.A. C)",null,null,null,null,null,0,0,0,44.100000000000058,12.675736961451218,null,null,"Drainage Area C:"]
[null,null,null,null,null,null,null,{"$f":"ROUND(IF(K55>0,(SUMPRODUCT(E56:H56,E57:H57)+SUMPRODUCT(E60:H60,E61:H61)+SUMPRODUCT(E58:H58,E59:H59)+SUMPRODUCT(E62:H62,E63:H63))/K55,0),0)","v":0},null,null,null,null,null,0,0,0,44.20000000000006,12.624434389140241]
[null,null,null,null,"1-year storm","2-year storm","10-year storm",null,null,null,null,null,null,0,0,0,44.300000000000061,12.573363431151211,null,null,"S (in)"]
[null,"RVDeveloped (watershed-inch) with no Runoff Reduction*",null,null,{"$f":"IF(E$6>0.2*($U67),(E$6-0.2*($U67))^2/(E$6+0.8*($U67)),0)","v":0},{"$f":"IF(F$6>0.2*($U67),(F$6-0.2*($U67))^2/(F$6+0.8*($U67)),0)","v":0},{"$f":"IF(G$6>0.2*($U67),(G$6-0.2*($U67))^2/(G$6+0.8*($U67)),0)","v":0},null,null,null,null,null,null,0,0,0,44.400000000000063,12.52252252252249,null,null,{"$f":"IF(H65>0,1000/H65-10,1000)","v":1000}]
[null,"RVDeveloped (watershed-inch) with Runoff Reduction*",null,null,{"$f":"IF($K55>0,IF(E67>0,(IFERROR(MAX(E67-$K57/3630/$K55,0),\"Check Areas!\")),E67),E67)","v":0},{"$f":"IF($K55>0,IF(F67>0,(IFERROR(MAX(F67-$K57/3630/$K55,0),\"Check Areas!\")),F67),F67)","v":0},{"$f":"IF($K55>0,IF(G67>0,(IFERROR(MAX(G67-$K57/3630/$K55,0),\"Check Areas!\")),G67),G67)","v":0},null,null,null,null,null,null,0,0,0,44.500000000000064,12.471910112359517]
[null,null,null,"Adjusted CN*",{"$f":"IF($K55>0,VLOOKUP(E68,N$23:$R$676,4),0)","v":0},{"$f":"IF($K55>0,VLOOKUP(F68,O$23:$R$676,3),0)","v":0},{"$f":"IF($K55>0,VLOOKUP(G68,P$23:$R$676,2),0)","v":0},null,null,null,null,null,null,0,0,0,44.600000000000065,12.421524663677097]
[null,null,null,"*See Notes above",null,null,null,null,null,null,null,null,null,0,0,0,44.700000000000067,12.371364653243816]
[null,"Drainage Area D",null,null,"A Soils","B Soils","C Soils","D Soils",null,"Total Area (acres):",{"$f":"'D.A. D'!$F$9","v":0},null,null,0,0,0,44.800000000000068,12.321428571428537]
[null,"Forest -- undisturbed, protected forest or reforested land",null,"Area (acres)",{"$f":"'D.A. D'!$B$5","v":0},{"$f":"'D.A. D'!$C$5","v":0},{"$f":"'D.A. D'!$D$5","v":0},{"$f":"'D.A. D'!$E$5","v":0},null,"Runoff Reduction Volume (ft3):",null,null,null,0,0,0,44.90000000000007,12.271714922048965]
[null,null,null,"CN",{"$f":"Constants!$H$7","v":30},{"$f":"Constants!$I$7","v":55},{"$f":"Constants!$J$7","v":70},{"$f":"Constants!$K$7","v":77},null,null,{"$f":"'D.A. D'!$F$71","v":0},null,null,0,0,0,45.000000000000071,12.222222222222186]
[null,"Mixed Open -- undisturbed/infrequently maintained grass or shrub land",null,"Area (acres)",{"$f":"'D.A. D'!$B$6","v":0},{"$f":"'D.A. D'!$C$6","v":0},{"$f":"'D.A. D'!$D$6","v":0},{"$f":"'D.A. D'!$E$6","v":0},null,null,null,null,null,0,0,0,45.100000000000072,12.172949002217258]
[null,null,null,"CN",{"$f":"Constants!$H$8","v":34},{"$f":"Constants!$I$8","v":59},{"$f":"Constants!$J$8","v":72},{"$f":"Constants!$K$8","v":79},null,null,null,null,null,0,0,0,45.200000000000074,12.123893805309699]
[null,"Managed Turf -- disturbed, graded for yards or other turf to be mowed/managed",null,"Area (acres)",{"$f":"'D.A. D'!$B$7","v":0},{"$f":"'D.A. D'!$C$7","v":0},{"$f":"'D.A. D'!$D$7","v":0},{"$f":"'D.A. D'!$E$7","v":0},null,null,null,null,null,0,0,0,45.300000000000075,12.075055187637933]
[null,null,null,"CN",{"$f":"Constants!$H$9","v":39},{"$f":"Constants!$I$9","v":61},{"$f":"Constants!$J$9","v":74},{"$f":"Constants!$K$9","v":80},null,null,null,null,null,0,0,0,45.400000000000077,12.026431718061637]
[null,"Impervious Cover ",null,"Area (acres)",{"$f":"'D.A. D'!$B$8","v":0},{"$f":"'D.A. D'!$C$8","v":0},{"$f":"'D.A. D'!$D$8","v":0},{"$f":"'D.A. D'!$E$8","v":0},null,null,null,null,null,0,0,0,45.500000000000078,11.978021978021939]
[null,null,null,"CN",{"$f":"Constants!$H$10","v":98},{"$f":"Constants!$I$10","v":98},{"$f":"Constants!$J$10","v":98},{"$f":"Constants!$K$10","v":98},null,null,null,null,null,0,0,0,45.60000000000008,11.929824561403471]
[null,null,null,null,null,null,null,"CN(D.A. D)",null,null,null,null,null,0,0,0,45.700000000000081,11.88183807439821,null,null,"Drainage Area D:"]
[null,null,null,null,null,null,null,{"$f":"ROUND(IF(K71>0,(SUMPRODUCT(E72:H72,E73:H73)+SUMPRODUCT(E76:H76,E77:H77)+SUMPRODUCT(E74:H74,E75:H75)+SUMPRODUCT(E78:H78,E79:H79))/K71,0),0)","v":0},null,null,null,null,null,0,0,0,45.800000000000082,11.83406113537114]
[null,null,null,null,"1-year storm","2-year storm","10-year storm",null,null,null,null,null,null,0,0,0,45.900000000000084,11.786492374727629,null,null,"S (in)"]
[null,"RVDeveloped (watershed-inch) with no Runoff Reduction*",null,null,{"$f":"IF(E$6>0.2*($U83),(E$6-0.2*($U83))^2/(E$6+0.8*($U83)),0)","v":0},{"$f":"IF(F$6>0.2*($U83),(F$6-0.2*($U83))^2/(F$6+0.8*($U83)),0)","v":0},{"$f":"IF(G$6>0.2*($U83),(G$6-0.2*($U83))^2/(G$6+0.8*($U83)),0)","v":0},null,null,null,null,null,null,0,0,0,46.000000000000085,11.739130434782567,null,null,{"$f":"IF(H81>0,1000/H81-10,1000)","v":1000}]
[null,"RVDeveloped (watershed-inch) with Runoff Reduction*",null,null,{"$f":"IF($K71>0,IF(E83>0,(IFERROR(MAX(E83-$K73/3630/$K71,0),\"Check Areas!\")),E83),E83)","v":0},{"$f":"IF($K71>0,IF(F83>0,(IFERROR(MAX(F83-$K73/3630/$K71,0),\"Check Areas!\")),F83),F83)","v":0},{"$f":"IF($K71>0,IF(G83>0,(IFERROR(MAX(G83-$K73/3630/$K71,0),\"Check Areas!\")),G83),G83)","v":0},null,null,null,null,null,null,0,0,0,46.100000000000087,11.691973969631196]
[null,null,null,"Adjusted CN*",{"$f":"IF($K71>0,VLOOKUP(E84,N$23:$R$676,4),0)","v":0},{"$f":"IF($K71>0,VLOOKUP(F84,O$23:$R$676,3),0)","v":0},{"$f":"IF($K71>0,VLOOKUP(G84,P$23:$R$676,2),0)","v":0},null,null,null,null,null,null,0,0,0,46.200000000000088,11.645021645021604]
[null,null,null,"*See Notes above",null,null,null,null,null,null,null,null,null,0,0,0,46.30000000000009,11.5982721382289]
[null,"Drainage Area E",null,null,"A Soils","B Soils","C Soils","D Soils",null,"Total Area (acres):",{"$f":"'D.A. E'!$F$9","v":0},null,null,0,0,0,46.400000000000091,{"$f":"IF(Q87>0,1000/Q87-10,1000)","v":11.551724137930993}]
[null,"Forest -- undisturbed, protected forest or reforested land",null,"Area (acres)",{"$f":"'D.A. E'!$B$5","v":0},{"$f":"'D.A. E'!$C$5","v":0},{"$f":"'D.A. E'!$D$5","v":0},{"$f":"'D.A. E'!$E$5","v":0},null,"Runoff Reduction Volume (ft3):",null,null,null,0,{"$f":"IF(F$6>0.2*($R88),(F$6-0.2*($R88))^2/(F$6+0.8*($R88)),0)","v":0},{"$f":"IF(G$6>0.2*($R88),(G$6-0.2*($R88))^2/(G$6+0.8*($R88)),0)","v":0},{"$f":"Q87+0.1","v":46.500000000000092},11.505376344085978]
[null,null,null,"CN",{"$f":"Constants!$H$7","v":30},{"$f":"Constants!$I$7","v":55},{"$f":"Constants!$J$7","v":70},{"$f":"Constants!$K$7","v":77},null,null,{"$f":"'D.A. E'!$F$71","v":0},null,null,0,0,0,46.600000000000094,11.459227467811115]
[null,"Mixed Open -- undisturbed/infrequently maintained grass or shrub land",null,"Area (acres)",{"$f":"'D.A. E'!$B$6","v":0},{"$f":"'D.A. E'!$C$6","v":0},{"$f":"'D.A. E'!$D$6","v":0},{"$f":"'D.A. E'!$E$6","v":0},null,null,null,null,null,0,0,0,46.700000000000095,11.413276231263339]
[null,null,null,"CN",{"$f":"Constants!$H$8","v":34},{"$f":"Constants!$I$8","v":59},{"$f":"Constants!$J$8","v":72},{"$f":"Constants!$K$8","v":79},null,null,null,null,null,0,0,0,46.800000000000097,11.367521367521324]
[null,"Managed Turf -- disturbed, graded for yards or other turf to be mowed/managed",null,"Area (acres)",{"$f":"'D.A. E'!$B$7","v":0},{"$f":"'D.A. E'!$C$7","v":0},{"$f":"'D.A. E'!$D$7","v":0},{"$f":"'D.A. E'!$E$7","v":0},null,null,null,null,null,0,0,0,46.900000000000098,11.32196162046904]
[null,null,null,"CN",{"$f":"Constants!$H$9","v":39},{"$f":"Constants!$I$9","v":61},{"$f":"Constants!$J$9","v":74},{"$f":"Constants!$K$9","v":80},null,null,null,null,null,0,0,0,47.000000000000099,11.276595744680805]
[null,"Impervious Cover ",null,"Area (acres)",{"$f":"'D.A. E'!$B$8","v":0},{"$f":"'D.A. E'!$C$8","v":0},{"$f":"'D.A. E'!$D$8","v":0},{"$f":"'D.A. E'!$E$8","v":0},null,null,null,null,null,0,0,0,47.100000000000101,11.231422505307812]
[null,null,null,"CN",{"$f":"Constants!$H$10","v":98},{"$f":"Constants!$I$10","v":98},{"$f":"Constants!$J$10","v":98},{"$f":"Constants!$K$10","v":98},null,null,null,null,null,0,0,0,47.200000000000102,11.186440677966054]
[null,null,null,null,null,null,null,"CN(D.A. E)",null,null,null,null,null,0,0,0,47.300000000000104,11.141649048625748,null,null,"Drainage Area E:"]
[null,null,null,null,null,null,null,{"$f":"ROUND(IF(K87>0,(SUMPRODUCT(E88:H88,E89:H89)+SUMPRODUCT(E92:H92,E93:H93)+SUMPRODUCT(E90:H90,E91:H91)+SUMPRODUCT(E94:H94,E95:H95))/K87,0),0)","v":0},null,null,null,null,null,0,0,0,47.400000000000105,11.097046413502063]
[null,null,null,null,"1-year storm","2-year storm","10-year storm",null,null,null,null,null,null,0,0,0,47.500000000000107,11.05263157894732,null,null,"S (in)"]
[null,"RVDeveloped (watershed-inch) with no Runoff Reduction*",null,null,{"$f":"IF(E$6>0.2*($U99),(E$6-0.2*($U99))^2/(E$6+0.8*($U99)),0)","v":0},{"$f":"IF(F$6>0.2*($U99),(F$6-0.2*($U99))^2/(F$6+0.8*($U99)),0)","v":0},{"$f":"IF(G$6>0.2*($U99),(G$6-0.2*($U99))^2/(G$6+0.8*($U99)),0)","v":0},null,null,null,null,null,null,0,0,0,47.600000000000108,11.008403361344492,null,null,{"$f":"IF(H97>0,1000/H97-10,1000)","v":1000}]
[null,"RVDeveloped (watershed-inch) with Runoff Reduction*",null,null,{"$f":"IF($K87>0,IF(E99>0,(IFERROR(MAX(E99-$K89/3630/$K87,0),\"Check Areas!\")),E99),E99)","v":0},{"$f":"IF($K87>0,IF(F99>0,(IFERROR(MAX(F99-$K89/3630/$K87,0),\"Check Areas!\")),F99),F99)","v":0},{"$f":"IF($K87>0,IF(G99>0,(IFERROR(MAX(G99-$K89/3630/$K87,0),\"Check Areas!\")),G99),G99)","v":0},null,null,null,null,null,null,0,0,0,47.700000000000109,10.964360587002048]
[null,null,null,"Adjusted CN*",{"$f":"IF($K87>0,VLOOKUP(E100,N$23:$R$676,4),0)","v":0},{"$f":"IF($K87>0,VLOOKUP(F100,O$23:$R$676,3),0)","v":0},{"$f":"IF($K87>0,VLOOKUP(G100,P$23:$R$676,2),0)","v":0},null,null,null,null,null,null,0,0,0,47.800000000000111,10.92050209205016]
[null,null,null,"*See Notes above",null,null,null,null,null,null,null,null,null,0,0,0,47.900000000000112,10.876826722338155]
[null,null,null,null,null,null,null,null,null,null,null,null,null,0,0,0,48.000000000000114,10.833333333333282]
[null,".",null,null,null,null,null,null,null,null,null,null,null,0,0,0,48.100000000000115,10.790020790020741]
[null,null,null,null,null,null,null,null,null,null,null,null,null,0,0,0,48.200000000000117,10.74688796680493]
[null,null,null,null,null,null,null,null,null,null,null,null,null,0,0,0,48.300000000000118,10.703933747411959]
[null,null,null,null,null,null,null,null,null,null,null,null,null,0,0,0,48.400000000000119,10.661157024793336]
[null,null,null,null,null,null,null,null,null,null,null,null,null,0,0,0,48.500000000000121,10.618556701030876]
[null,null,null,null,null,null,null,null,null,null,null,null,null,0,0,0,48.600000000000122,10.576131687242746]
[null,null,null,null,null,null,null,null,null,null,null,null,null,0,0,0,48.700000000000124,10.533880903490708]
[null,null,null,null,null,null,null,null,null,null,null,null,null,0,0,0,48.800000000000125,10.491803278688472]
[null,null,null,null,null,null,null,null,null,null,null,null,null,0,0,0,48.900000000000126,10.449897750511195]
[null,null,null,null,null,null,null,null,null,null,null,null,null,0,0,0,49.000000000000128,10.408163265306069]
[null,null,null,null,null,null,null,null,null,null,null,null,null,{"$f":"IF(E$6>0.2*($R114),(E$6-0.2*($R114))^2/(E$6+0.8*($R114)),0)","v":0},0,0,49.100000000000129,10.366598778004018]
[null,null,null,null,null,null,null,null,null,null,null,null,null,0,0,0,49.200000000000131,10.325203252032466]
[]
[]
[]
[]
[]
[]
[]
[]
[]
[]
[]
[]
[]
[]
[]
[]
[]
[]
[]
[]
[]
[]
[]
[]
[]
[]
[]
[]
[]
[]
[]
[]
[]
[]
[]
[]
[]
[]
[]
[]
[]
[]
[]
[null,null,null,null,null,null,null,null,null,null,null,null,null,{"$f":"IF(E$6>0.2*($R159),(E$6-0.2*($R159))^2/(E$6+0.8*($R159)),0)","v":0},{"$f":"IF(F$6>0.2*($R159),(F$6-0.2*($R159))^2/(F$6+0.8*($R159)),0)","v":0},{"$f":"IF(G$6>0.2*($R159),(G$6-0.2*($R159))^2/(G$6+0.8*($R159)),0)","v":0},{"$f":"Q115+0.1","v":49.300000000000132},{"$f":"IF(Q159>0,1000/Q159-10,1000)","v":10.283975659229153}]
[null,null,null,null,null,null,null,null,null,null,null,null,null,{"$f":"IF(E$6>0.2*($R160),(E$6-0.2*($R160))^2/(E$6+0.8*($R160)),0)","v":0},{"$f":"IF(F$6>0.2*($R160),(F$6-0.2*($R160))^2/(F$6+0.8*($R160)),0)","v":0},{"$f":"IF(G$6>0.2*($R160),(G$6-0.2*($R160))^2/(G$6+0.8*($R160)),0)","v":0},{"$f":"Q159+0.1","v":49.400000000000134},10.242914979757032]
[null,null,null,null,null,null,null,null,null,null,null,null,null,0,0,0,49.500000000000135,10.202020202020147]
[null,null,null,null,null,null,null,null,null,null,null,null,null,0,0,0,49.600000000000136,10.161290322580591]
[null,null,null,null,null,null,null,null,null,null,null,null,null,0,0,0,49.700000000000138,10.120724346076404]
[null,null,null,null,null,null,null,null,null,null,null,null,null,0,0,0,49.800000000000139,10.080321285140506]
[null,null,null,null,null,null,null,null,null,null,null,null,null,0,0,0,49.900000000000141,10.040080160320585]
[null,null,null,null,null,null,null,null,null,null,null,null,null,0,0,0,50.000000000000142,9.9999999999999432]
[null,null,null,null,null,null,null,null,null,null,null,null,null,0,0,0,50.100000000000144,9.9600798403193025]
[null,null,null,null,null,null,null,null,null,null,null,null,null,0,0,0,50.200000000000145,9.9203187250995448]
[null,null,null,null,null,null,null,null,null,null,null,null,null,0,0,0,50.300000000000146,9.8807157057653505]
[null,null,null,null,null,null,null,null,null,null,null,null,null,0,0,0,50.400000000000148,9.8412698412697814]
[null,null,null,null,null,null,null,null,null,null,null,null,null,0,0,0,50.500000000000149,9.801980198019745]
[null,null,null,null,null,null,null,null,null,null,null,null,null,0,0,0,50.600000000000151,9.7628458498023143]
[null,null,null,null,null,null,null,null,null,null,null,null,null,0,0,0,50.700000000000152,9.7238658777119724]
[null,null,null,null,null,null,null,null,null,null,null,null,null,0,0,0,50.800000000000153,9.6850393700786803]
[null,null,null,null,null,null,null,null,null,null,null,null,null,0,0,0,50.900000000000155,9.6463654223967978]
[null,null,null,null,null,null,null,null,null,null,null,null,null,0,0,0,51.000000000000156,9.607843137254843]
[null,null,null,null,null,null,null,null,null,null,null,null,null,0,0,0,51.100000000000158,9.569471624266086]
[null,null,null,null,null,null,null,null,null,null,null,null,null,0,0,0,51.200000000000159,9.5312499999999396]
[null,null,null,null,null,null,null,null,null,null,null,null,null,0,0,0,51.300000000000161,9.4931773879141694]
[null,null,null,null,null,null,null,null,null,null,null,null,null,0,0,0,51.400000000000162,9.4552529182878757]
[null,null,null,null,null,null,null,null,null,null,null,null,null,0,0,0,51.500000000000163,9.4174757281552779]
[null,null,null,null,null,null,null,null,null,null,null,null,null,0,0,0,51.600000000000165,9.3798449612402486]
[null,null,null,null,null,null,null,null,null,null,null,null,null,0,0,0,51.700000000000166,9.3423597678916188]
[null,null,null,null,null,null,null,null,null,null,null,null,null,0,0,0,51.800000000000168,9.3050193050192433]
[null,null,null,null,null,null,null,null,null,null,null,null,null,0,0,0,51.900000000000169,9.2678227360307659]
[null,null,null,null,null,null,null,null,null,null,null,null,null,0,0,0,52.000000000000171,9.230769230769166]
[null,null,null,null,null,null,null,null,null,null,null,null,null,0,0,0,52.100000000000172,9.1938579654509915]
[null,null,null,null,null,null,null,null,null,null,null,null,null,0,0,0,52.200000000000173,9.1570881226053018]
[null,null,null,null,null,null,null,null,null,null,null,null,null,0,0,0,52.300000000000175,9.1204588910133211]
[null,null,null,null,null,null,null,null,null,null,null,null,null,0,0,0,52.400000000000176,9.0839694656487922]
[null,null,null,null,null,null,null,null,null,null,null,null,null,0,0,0,52.500000000000178,9.0476190476189835]
[null,null,null,null,null,null,null,null,null,null,null,null,null,0,0,0,52.600000000000179,9.0114068441063999]
[null,null,null,null,null,null,null,null,null,null,null,null,null,0,0,0,52.70000000000018,8.9753320683111291]
[null,null,null,null,null,null,null,null,null,null,null,null,null,0,0,0,52.800000000000182,8.9393939393938737]
[null,null,null,null,null,null,null,null,null,null,null,null,null,0,0,0,52.900000000000183,8.9035916824195951]
[null,null,null,null,null,null,null,null,null,null,null,null,null,0,0,0,53.000000000000185,8.8679245283018204]
[null,null,null,null,null,null,null,null,null,null,null,null,null,0,0,0,53.100000000000186,8.8323917137475796]
[null,null,null,null,null,null,null,null,null,null,null,null,null,0,0,0,53.200000000000188,8.7969924812029419]
[null,null,null,null,null,null,null,null,null,null,null,null,null,0,0,0,53.300000000000189,8.7617260787991817]
[null,null,null,null,null,null,null,null,null,null,null,null,null,0,0,0,53.40000000000019,8.7265917602995593]
[null,null,null,null,null,null,null,null,null,null,null,null,null,0,0,0,53.500000000000192,8.6915887850466618]
[null,null,null,null,null,null,null,null,null,null,null,null,null,0,0,0,53.600000000000193,8.6567164179103813]
[null,null,null,null,null,null,null,null,null,null,null,null,null,0,0,0,53.700000000000195,8.6219739292364324]
[null,null,null,null,null,null,null,null,null,null,null,null,null,0,0,0,53.800000000000196,8.5873605947954701]
[null,null,null,null,null,null,null,null,null,null,null,null,null,0,0,0,53.900000000000198,8.5528756957327694]
[null,null,null,null,null,null,null,null,null,null,null,null,null,0,0,0,54.000000000000199,8.5185185185184515]
[null,null,null,null,null,null,null,null,null,null,null,null,null,0,0,0,54.1000000000002,8.4842883548982684]
[null,null,null,null,null,null,null,null,null,null,null,null,null,0,0,0,54.200000000000202,8.4501845018449515]
[null,null,null,null,null,null,null,null,null,null,null,null,null,0,0,0,54.300000000000203,8.4162062615100588]
[null,null,null,null,null,null,null,null,null,null,null,null,null,0,0,0,54.400000000000205,8.3823529411764]
[null,null,null,null,null,null,null,null,null,null,null,null,null,0,0,0,54.500000000000206,8.3486238532109383]
[null,null,null,null,null,null,null,null,null,null,null,null,null,0,0,0,54.600000000000207,8.3150183150182464]
[null,null,null,null,null,null,null,null,null,null,null,null,null,0,0,0,54.700000000000209,8.2815356489944456]
[null,null,null,null,null,null,null,null,null,null,null,null,null,0,0,0,54.80000000000021,8.2481751824816811]
[null,null,null,null,null,null,null,null,null,null,null,null,null,0,0,0,54.900000000000212,8.2149362477230632]
[null,null,null,null,null,null,null,null,null,null,null,null,null,0,0,0,55.000000000000213,8.1818181818181124]
[null,null,null,null,null,null,null,null,null,null,null,null,null,0,0,0,55.100000000000215,8.1488203266786954]
[null,null,null,null,null,null,null,null,null,null,null,null,null,0,0,0,55.200000000000216,8.1159420289854367]
[null,null,null,null,null,null,null,null,null,null,null,null,null,0,0,0,55.300000000000217,8.0831826401445959]
[null,null,null,null,null,null,null,null,null,null,null,null,null,0,0,0,55.400000000000219,8.050541516245417]
[null,null,null,null,null,null,null,null,null,null,null,null,null,0,0,0,55.50000000000022,8.0180180180179477]
[null,null,null,null,null,null,null,null,null,null,null,null,null,0,0,0,55.600000000000222,7.9856115107912942]
[null,null,null,null,null,null,null,null,null,null,null,null,null,0,0,0,55.700000000000223,{"$f":"IF(Q223>0,1000/Q223-10,1000)","v":7.9533213644523535}]
[null,null,null,null,null,null,null,null,null,null,null,null,null,{"$f":"IF(E$6>0.2*($R224),(E$6-0.2*($R224))^2/(E$6+0.8*($R224)),0)","v":0},{"$f":"IF(F$6>0.2*($R224),(F$6-0.2*($R224))^2/(F$6+0.8*($R224)),0)","v":0},{"$f":"IF(G$6>0.2*($R224),(G$6-0.2*($R224))^2/(G$6+0.8*($R224)),0)","v":0},{"$f":"Q223+0.1","v":55.800000000000225},7.9211469534049463]
[null,null,null,null,null,null,null,null,null,null,null,null,null,0,0,0,55.900000000000226,7.8890876565294441]
[null,null,null,null,null,null,null,null,null,null,null,null,null,0,0,0,56.000000000000227,7.857142857142783]
[null,null,null,null,null,null,null,null,null,null,null,null,null,0,0,0,56.100000000000229,7.8253119429589297]
[null,null,null,null,null,null,null,null,null,null,null,null,null,0,0,0,56.20000000000023,7.7935943060497479]
[null,null,null,null,null,null,null,null,null,null,null,null,null,0,0,0,56.300000000000232,7.76198934280632]
[null,null,null,null,null,null,null,null,null,null,null,null,null,0,0,0,56.400000000000233,7.7304964539006349]
[null,null,null,null,null,null,null,null,null,null,null,null,null,0,0,0,56.500000000000234,7.6991150442477156]
[null,null,null,null,null,null,null,null,null,null,null,null,null,0,0,0,56.600000000000236,7.6678445229681245]
[null,null,null,null,null,null,null,null,null,null,null,null,null,0,0,0,56.700000000000237,7.6366843033508971]
[null,null,null,null,null,null,null,null,null,null,null,null,null,0,0,0,56.800000000000239,7.6056338028168291]
[null,null,null,null,null,null,null,null,null,null,null,null,null,0,0,0,56.90000000000024,7.5746924428821742]
[null,null,null,null,null,null,null,null,null,null,null,null,null,0,0,0,57.000000000000242,7.5438596491227337]
[null,null,null,null,null,null,null,null,null,null,null,null,null,0,0,0,57.100000000000243,7.5131348511382789]
[null,null,null,null,null,null,null,null,null,null,null,null,null,0,0,0,57.200000000000244,7.4825174825174088]
[null,null,null,null,null,null,null,null,null,null,null,null,null,0,0,0,57.300000000000246,7.4520069808027181]
[null,null,null,null,null,null,null,null,null,null,null,null,null,0,0,0,57.400000000000247,7.4216027874563721]
[null,null,null,null,null,null,null,null,null,null,null,null,null,0,0,0,57.500000000000249,7.3913043478260114]
[null,null,null,null,null,null,null,null,null,null,null,null,null,0,0,0,57.60000000000025,7.3611111111110361]
[null,null,null,null,null,null,null,null,null,null,null,null,null,0,0,0,57.700000000000252,7.3310225303292142]
[null,null,null,null,null,null,null,null,null,null,null,null,null,0,0,0,57.800000000000253,7.3010380622836628]
[null,null,null,null,null,null,null,null,null,null,null,null,null,0,0,0,57.900000000000254,7.2711571675301485]
[null,null,null,null,null,null,null,null,null,null,null,null,null,0,0,0,58.000000000000256,7.241379310344751]
[null,null,null,null,null,null,null,null,null,null,null,null,null,0,0,0,58.100000000000257,7.2117039586918352]
[null,null,null,null,null,null,null,null,null,null,null,null,null,0,0,0,58.200000000000259,7.1821305841923646]
[null,null,null,null,null,null,null,null,null,null,null,null,null,0,0,0,58.30000000000026,7.1526586620925485]
[null,null,null,null,null,null,null,null,null,null,null,null,null,0,0,0,58.400000000000261,7.1232876712327986]
[null,null,null,null,null,null,null,null,null,null,null,null,null,0,0,0,58.500000000000263,7.0940170940170155]
[null,null,null,null,null,null,null,null,null,null,null,null,null,0,0,0,58.600000000000264,7.0648464163821743]
[null,null,null,null,null,null,null,null,null,null,null,null,null,0,0,0,58.700000000000266,7.0357751277682361]
[null,null,null,null,null,null,null,null,null,null,null,null,null,0,0,0,58.800000000000267,7.0068027210883592]
[null,null,null,null,null,null,null,null,null,null,null,null,null,0,0,0,58.900000000000269,6.9779286926994146]
[null,null,null,null,null,null,null,null,null,null,null,null,null,0,0,0,59.00000000000027,6.9491525423728042]
[null,null,null,null,null,null,null,null,null,null,null,null,null,0,0,0,59.100000000000271,6.9204737732655737]
[null,null,null,null,null,null,null,null,null,null,null,null,null,0,0,0,59.200000000000273,6.8918918918918131]
[null,null,null,null,null,null,null,null,null,null,null,null,null,0,0,0,59.300000000000274,6.863406408094356]
[null,null,null,null,null,null,null,null,null,null,null,null,null,0,0,0,59.400000000000276,6.8350168350167557]
[null,null,null,null,null,null,null,null,null,null,null,null,null,0,0,0,59.500000000000277,6.8067226890755528]
[null,null,null,null,null,null,null,null,null,null,null,null,null,0,0,0,59.600000000000279,6.7785234899328088]
[null,null,null,null,null,null,null,null,null,null,null,null,null,0,0,0,59.70000000000028,6.7504187604689321]
[null,null,null,null,null,null,null,null,null,null,null,null,null,0,0,0,59.800000000000281,6.7224080267557724]
[null,null,null,null,null,null,null,null,null,null,null,null,null,0,0,0,59.900000000000283,6.6944908180299727]
[null,null,null,null,null,null,null,null,null,null,null,null,null,0,0,0,60.000000000000284,6.6666666666665861]
[null,null,null,null,null,null,null,null,null,null,null,null,null,0,0,0,60.100000000000286,6.6389351081529995]
[null,null,null,null,null,null,null,null,null,null,null,null,null,0,0,0,60.200000000000287,6.6112956810630443]
[null,null,null,null,null,null,null,null,null,null,null,null,null,0,0,0,60.300000000000288,6.5837479270314283]
[null,null,null,null,null,null,null,null,null,null,null,null,null,0,0,0,60.40000000000029,6.5562913907283971]
[null,null,null,null,null,null,null,null,null,null,null,null,null,0,0,0,60.500000000000291,6.5289256198346308]
[null,null,null,null,null,null,null,null,null,null,null,null,null,0,0,0,60.600000000000293,6.5016501650164216]
[null,null,null,null,null,null,null,null,null,null,null,null,null,0,0,0,60.700000000000294,6.474464579901074]
[null,null,null,null,null,null,null,null,null,null,null,null,null,0,0,0,60.800000000000296,6.4473684210525519]
[null,null,null,null,null,null,null,null,null,null,null,null,null,0,0,0,60.900000000000297,6.4203612479473762]
[null,null,null,null,null,null,null,null,null,null,null,null,null,0,0,0,61.000000000000298,6.3934426229507402]
[null,null,null,null,null,null,null,null,null,null,null,null,null,0,0,0,61.1000000000003,6.3666121112928806]
[null,null,null,null,null,null,null,null,null,null,null,null,null,0,0,0,61.200000000000301,6.3398692810456723]
[null,null,null,null,null,null,null,null,null,null,null,null,null,0,0,0,61.300000000000303,6.3132137030994286]
[null,null,null,null,null,null,null,null,null,null,null,null,null,0,0,0,61.400000000000304,6.2866449511399836]
[null,null,null,null,null,null,null,null,null,null,null,null,null,0,0,0,61.500000000000306,6.260162601625936]
[null,null,null,null,null,null,null,null,null,null,null,null,null,0,0,0,61.600000000000307,6.2337662337661541]
[null,null,null,null,null,null,null,null,null,null,null,null,null,0,0,0,61.700000000000308,6.2074554294974895]
[null,null,null,null,null,null,null,null,null,null,null,null,null,0,0,0,61.80000000000031,6.1812297734627037]
[null,null,null,null,null,null,null,null,null,null,null,null,null,0,0,0,61.900000000000311,6.1550888529886087]
[null,null,null,null,null,null,null,null,null,null,null,null,null,0,0,0,62.000000000000313,6.1290322580644343]
[null,null,null,null,null,null,null,null,null,null,null,null,null,0,0,0,62.100000000000314,{"$f":"IF(Q287>0,1000/Q287-10,1000)","v":6.1030595813203696}]
[null,null,null,null,null,null,null,null,null,null,null,null,null,{"$f":"IF(E$6>0.2*($R288),(E$6-0.2*($R288))^2/(E$6+0.8*($R288)),0)","v":0},{"$f":"IF(F$6>0.2*($R288),(F$6-0.2*($R288))^2/(F$6+0.8*($R288)),0)","v":0},{"$f":"IF(G$6>0.2*($R288),(G$6-0.2*($R288))^2/(G$6+0.8*($R288)),0)","v":0},{"$f":"Q287+0.1","v":62.200000000000315},6.0771704180063502]
[null,null,null,null,null,null,null,null,null,null,null,null,null,0,0,0,62.300000000000317,6.0513643659710254]
[null,null,null,null,null,null,null,null,null,null,null,null,null,0,0,0,62.400000000000318,6.0256410256409438]
[null,null,null,null,null,null,null,null,null,null,null,null,null,0,0,0,62.50000000000032,5.9999999999999183]
[null,null,null,null,null,null,null,null,null,null,null,null,null,0,0,0,62.600000000000321,5.9744408945686089]
[null,null,null,null,null,null,null,null,null,null,null,null,null,0,0,0,62.700000000000323,5.9489633173842886]
[null,null,null,null,null,null,null,null,null,null,null,null,null,0,0,0,62.800000000000324,5.9235668789808091]
[null,null,null,null,null,null,null,null,null,null,null,null,null,0,0,0,62.900000000000325,5.8982511923687575]
[null,null,null,null,null,null,null,null,null,null,null,null,null,0,0,0,63.000000000000327,5.87301587301579]
[null,null,null,null,null,null,null,null,null,null,null,null,null,0,0,0,63.100000000000328,5.8478605388271756]
[null,null,null,null,null,null,null,null,null,null,null,null,null,0,0,0,63.20000000000033,5.8227848101264996]
[null,null,null,null,null,null,null,null,null,null,null,null,null,0,0,0,63.300000000000331,5.7977883096365677]
[null,null,null,null,null,null,null,null,null,null,null,null,null,0,0,0,63.400000000000333,5.7728706624604857]
[null,null,null,null,null,null,null,null,null,null,null,null,null,0,0,0,63.500000000000334,5.7480314960629091]
[null,null,null,null,null,null,null,null,null,null,null,null,null,0,0,0,63.600000000000335,5.7232704402514898]
[null,null,null,null,null,null,null,null,null,null,null,null,null,0,0,0,63.700000000000337,5.698587127158472]
[null,null,null,null,null,null,null,null,null,null,null,null,null,0,0,0,63.800000000000338,5.673981191222488]
[null,null,null,null,null,null,null,null,null,null,null,null,null,0,0,0,63.90000000000034,5.6494522691704958]
[null,null,null,null,null,null,null,null,null,null,null,null,null,0,0,0,64.000000000000341,5.6249999999999165]
[null,null,null,null,null,null,null,null,null,null,null,null,null,0,0,0,64.100000000000335,5.6006240249609167]
[null,null,null,null,null,null,null,null,null,null,null,null,null,0,0,0,64.20000000000033,5.5763239875388599]
[null,null,null,null,null,null,null,null,null,null,null,null,null,0,0,0,64.300000000000324,5.5520995334369356]
[null,null,null,null,null,null,null,null,null,null,null,null,null,0,0,0,64.400000000000318,5.5279503105589303]
[null,null,null,null,null,null,null,null,null,null,null,null,null,0,0,0,64.500000000000313,5.5038759689921726]
[null,null,null,null,null,null,null,null,null,null,null,null,null,0,0,0,64.600000000000307,5.4798761609906386]
[null,null,null,null,null,null,null,null,null,null,null,null,null,0,0,0,64.700000000000301,5.455950540958197]
[null,null,null,null,null,null,null,null,null,null,null,null,null,0,0,0,64.800000000000296,5.4320987654320287]
[null,null,null,null,null,null,null,null,null,null,null,null,null,0,0,0,64.90000000000029,5.4083204930661868]
[null,null,null,null,null,null,null,null,null,null,null,null,null,0,0,0,65.000000000000284,5.3846153846153175]
[null,null,null,null,null,null,null,null,null,null,null,null,null,0,0,0,65.100000000000279,5.3609831029185209]
[null,null,null,null,null,null,null,null,null,null,null,null,null,0,0,0,65.200000000000273,5.3374233128833719]
[null,null,null,null,null,null,null,null,null,null,null,null,null,0,0,0,65.300000000000267,5.3139356814700758]
[null,null,null,null,null,null,null,null,null,null,null,null,null,0,0,0,65.400000000000261,5.2905198776757807]
[null,null,null,null,null,null,null,null,null,null,null,null,null,0,0,0,65.500000000000256,5.2671755725190241]
[null,null,null,null,null,null,null,null,null,null,null,null,null,0,0,0,65.60000000000025,5.2439024390243318]
[null,null,null,null,null,null,null,null,null,null,null,null,null,0,0,0,65.700000000000244,5.2207001522069447]
[null,null,null,null,null,null,null,null,null,null,null,null,null,0,0,0,65.800000000000239,5.1975683890576949]
[null,null,null,null,null,null,null,null,null,null,null,null,null,0,0,0,65.900000000000233,5.1745068285280187]
[null,null,null,null,null,null,null,null,null,null,null,null,null,0,0,0,66.000000000000227,5.151515151515099]
[null,null,null,null,null,null,null,null,null,null,null,null,null,0,0,0,66.100000000000222,5.1285930408471501]
[null,null,null,null,null,null,null,null,null,null,null,null,null,0,0,0,66.200000000000216,5.1057401812688337]
[null,null,null,null,null,null,null,null,null,null,null,null,null,0,0,0,66.30000000000021,5.0829562594267994]
[null,null,null,null,null,null,null,null,null,null,null,null,null,0,0,0,66.400000000000205,5.0602409638553745]
[null,null,null,null,null,null,null,null,null,null,null,null,null,0,0,0,66.500000000000199,5.0375939849623617]
[null,null,null,null,null,null,null,null,null,null,null,null,null,0,0,0,66.600000000000193,5.0150150150149706]
[null,null,null,null,null,null,null,null,null,null,null,null,null,0,0,0,66.700000000000188,4.9925037481258947]
[null,null,null,null,null,null,null,null,null,null,null,null,null,0,0,0,66.800000000000182,4.9700598802394804]
[null,null,null,null,null,null,null,null,null,null,null,null,null,0,0,0,66.900000000000176,4.9476831091180475]
[null,null,null,null,null,null,null,null,null,null,null,null,null,0,0,0,67.000000000000171,4.9253731343283196]
[null,null,null,null,null,null,null,null,null,null,null,null,null,0,0,0,67.100000000000165,4.9031296572279821]
[null,null,null,null,null,null,null,null,null,null,null,null,null,0,0,0,67.200000000000159,4.8809523809523458]
[null,null,null,null,null,null,null,null,null,null,null,null,null,0,0,0,67.300000000000153,4.8588410104011555]
[null,null,null,null,null,null,null,null,null,null,null,null,null,0,0,0,67.400000000000148,4.8367952522254871]
[null,null,null,null,null,null,null,null,null,null,null,null,null,0,0,0,67.500000000000142,4.8148148148147829]
[null,null,null,null,null,null,null,null,null,null,null,null,null,0,0,0,67.600000000000136,4.7928994082839935]
[null,null,null,null,null,null,null,null,null,null,null,null,null,0,0,0,67.700000000000131,4.7710487444608276]
[null,null,null,null,null,null,null,null,null,null,null,null,null,0,0,0,67.800000000000125,4.7492625368731289]
[null,null,null,null,null,null,null,null,null,null,null,null,null,0,0,0,67.900000000000119,4.7275405007363513]
[null,null,null,null,null,null,null,null,null,null,null,null,null,0,0,0,68.000000000000114,4.7058823529411526]
[null,null,null,null,null,null,null,null,null,null,null,null,null,0,0,0,68.100000000000108,4.6842878120410933]
[null,null,null,null,null,null,null,null,null,null,null,null,null,0,0,0,68.200000000000102,4.6627565982404473]
[null,null,null,null,null,null,null,null,null,null,null,null,null,0,0,0,68.300000000000097,4.6412884333821172]
[null,null,null,null,null,null,null,null,null,null,null,null,null,0,0,0,68.400000000000091,4.6198830409356528]
[null,null,null,null,null,null,null,null,null,null,null,null,null,0,0,0,68.500000000000085,{"$f":"IF(Q351>0,1000/Q351-10,1000)","v":4.5985401459853836}]
[null,null,null,null,null,null,null,null,null,null,null,null,null,{"$f":"IF(E$6>0.2*($R352),(E$6-0.2*($R352))^2/(E$6+0.8*($R352)),0)","v":0},{"$f":"IF(F$6>0.2*($R352),(F$6-0.2*($R352))^2/(F$6+0.8*($R352)),0)","v":0},{"$f":"IF(G$6>0.2*($R352),(G$6-0.2*($R352))^2/(G$6+0.8*($R352)),0)","v":0},{"$f":"Q351+0.1","v":68.60000000000008},4.5772594752186428]
[null,null,null,null,null,null,null,null,null,null,null,null,null,0,0,0,68.700000000000074,4.5560407569141042]
[null,null,null,null,null,null,null,null,null,null,null,null,null,0,0,0,68.800000000000068,4.5348837209302175]
[null,null,null,null,null,null,null,null,null,null,null,null,null,0,0,0,68.900000000000063,4.5137880986937464]
[null,null,null,null,null,null,null,null,null,null,null,null,null,0,0,0,69.000000000000057,4.4927536231883938]
[null,null,null,null,null,null,null,null,null,null,null,null,null,0,0,0,69.100000000000051,4.4717800289435488]
[null,null,null,null,null,null,null,null,null,null,null,null,null,0,0,0,69.200000000000045,4.4508670520231117]
[null,null,null,null,null,null,null,null,null,null,null,null,null,0,0,0,69.30000000000004,4.4300144300144222]
[null,null,null,null,null,null,null,null,null,null,null,null,null,0,0,0,69.400000000000034,4.4092219020172845]
[null,null,null,null,null,null,null,null,null,null,null,null,null,0,0,0,69.500000000000028,4.3884892086330876]
[null,null,null,null,null,null,null,null,null,null,null,null,null,0,0,0,69.600000000000023,4.367816091954019]
[null,null,null,null,null,null,null,null,null,null,null,null,null,0,0,0,69.700000000000017,4.3472022955523641]
[null,null,null,null,null,null,null,null,null,null,null,null,null,0,0,0,69.800000000000011,4.3266475644699121]
[null,null,null,null,null,null,null,null,null,null,null,null,null,0,0,0,69.900000000000006,4.3061516452074375]
[null,null,null,null,null,null,null,null,null,null,null,null,null,0,0,0,70,4.2857142857142865]
[null,null,null,null,null,null,null,null,null,null,null,null,null,0,0,0,70.099999999999994,4.2653352353780321]
[null,null,null,null,null,null,null,null,null,null,null,null,null,0,0,0,70.199999999999989,4.2450142450142465]
[null,null,null,null,null,null,null,null,null,null,null,null,null,0,0,0,70.299999999999983,4.2247510668563333]
[null,null,null,null,null,null,null,null,null,null,null,null,null,0,0,0,70.399999999999977,4.2045454545454586]
[null,null,null,null,null,null,null,null,null,null,null,null,null,0,0,0,70.499999999999972,4.1843971631205736]
[null,null,null,null,null,null,null,null,null,null,null,null,null,0,0,0,70.599999999999966,4.1643059490085061]
[null,null,null,null,null,null,null,null,null,null,null,null,null,0,0,0,70.69999999999996,4.144271570014153]
[null,null,null,null,null,null,null,null,null,null,null,null,null,0,0,0,70.799999999999955,4.1242937853107442]
[null,null,null,null,null,null,null,null,null,null,null,null,null,0,0,0,70.899999999999949,4.1043723554301934]
[null,null,null,null,null,null,null,null,null,null,null,null,null,0,0,0,70.999999999999943,4.0845070422535326]
[null,null,null,null,null,null,null,null,null,null,null,null,null,0,0,0,71.099999999999937,4.0646976090014189]
[null,null,null,null,null,null,null,null,null,null,null,null,null,0,0,0,71.199999999999932,4.0449438202247325]
[null,null,null,null,null,null,null,null,null,null,null,null,null,0,0,0,71.299999999999926,4.0252454417952457]
[null,null,null,null,null,null,null,null,null,null,null,null,null,0,0,0,71.39999999999992,4.0056022408963745]
[null,null,null,null,null,null,null,null,null,null,null,null,null,0,0,0,71.499999999999915,3.9860139860140027]
[null,null,null,null,null,null,null,null,null,null,null,null,null,0,0,0,71.599999999999909,3.9664804469273918]
[null,null,null,null,null,null,null,null,null,null,null,null,null,0,0,0,71.699999999999903,3.947001394700159]
[null,null,null,null,null,null,null,null,null,null,null,null,null,0,0,0,71.799999999999898,3.9275766016713298]
[null,null,null,null,null,null,null,null,null,null,null,null,null,0,0,0,71.899999999999892,3.908205841446474]
[null,null,null,null,null,null,null,null,null,null,null,null,null,0,0,0,71.999999999999886,3.8888888888889106]
[null,null,null,null,null,null,null,null,null,null,null,null,null,0,0,0,72.099999999999881,3.8696255201109793]
[null,null,null,null,null,null,null,null,null,null,null,null,null,0,0,0,72.199999999999875,3.850415512465398]
[null,null,null,null,null,null,null,null,null,null,null,null,null,0,0,0,72.299999999999869,3.8312586445366783]
[null,null,null,null,null,null,null,null,null,null,null,null,null,0,0,0,72.399999999999864,3.8121546961326231]
[null,null,null,null,null,null,null,null,null,null,null,null,null,0,0,0,72.499999999999858,3.7931034482758896]
[null,null,null,null,null,null,null,null,null,null,null,null,null,0,0,0,72.599999999999852,3.7741046831956204]
[null,null,null,null,null,null,null,null,null,null,null,null,null,0,0,0,72.699999999999847,3.7551581843191482]
[null,null,null,null,null,null,null,null,null,null,null,null,null,0,0,0,72.799999999999841,3.7362637362637656]
[null,null,null,null,null,null,null,null,null,null,null,null,null,0,0,0,72.899999999999835,3.7174211248285634]
[null,null,null,null,null,null,null,null,null,null,null,null,null,0,0,0,72.999999999999829,3.698630136986333]
[null,null,null,null,null,null,null,null,null,null,null,null,null,0,0,0,73.099999999999824,3.6798905608755454]
[null,null,null,null,null,null,null,null,null,null,null,null,null,0,0,0,73.199999999999818,3.6612021857923835]
[null,null,null,null,null,null,null,null,null,null,null,null,null,0,0,0,73.299999999999812,3.6425648021828447]
[null,null,null,null,null,null,null,null,null,null,null,null,null,0,0,0,73.399999999999807,3.6239782016349125]
[null,null,null,null,null,null,null,null,null,null,null,null,null,0,0,0,73.499999999999801,3.6054421768707847]
[null,null,null,null,null,null,null,null,null,null,null,null,null,0,0,0,73.599999999999795,3.5869565217391681]
[null,null,null,null,null,null,null,null,null,null,null,null,null,0,0,0,73.69999999999979,3.5685210312076379]
[null,null,null,null,null,null,null,null,null,null,null,null,null,0,0,0,73.799999999999784,3.5501355013550526]
[null,null,null,null,null,null,null,null,null,null,null,null,null,0,0,0,73.899999999999778,3.531799729364046]
[null,null,null,null,null,null,null,null,null,null,null,null,null,0,0,0,73.999999999999773,3.5135135135135549]
[null,null,null,null,null,null,null,null,null,null,null,null,null,0,0,0,74.099999999999767,3.4952766531714321]
[null,null,null,null,null,null,null,null,null,null,null,null,null,0,0,0,74.199999999999761,3.4770889487871059]
[null,null,null,null,null,null,null,null,null,null,null,null,null,0,0,0,74.299999999999756,3.4589502018842975]
[null,null,null,null,null,null,null,null,null,null,null,null,null,0,0,0,74.39999999999975,3.4408602150538083]
[null,null,null,null,null,null,null,null,null,null,null,null,null,0,0,0,74.499999999999744,3.4228187919463551]
[null,null,null,null,null,null,null,null,null,null,null,null,null,0,0,0,74.599999999999739,3.4048257372654618]
[null,null,null,null,null,null,null,null,null,null,null,null,null,0,0,0,74.699999999999733,3.3868808567604223]
[null,null,null,null,null,null,null,null,null,null,null,null,null,0,0,0,74.799999999999727,3.3689839572192994]
[null,null,null,null,null,null,null,null,null,null,null,null,null,0,0,0,74.899999999999721,{"$f":"IF(Q415>0,1000/Q415-10,1000)","v":3.3511348464619992}]
[null,null,null,null,null,null,null,null,null,null,null,null,null,{"$f":"IF(E$6>0.2*($R416),(E$6-0.2*($R416))^2/(E$6+0.8*($R416)),0)","v":0},{"$f":"IF(F$6>0.2*($R416),(F$6-0.2*($R416))^2/(F$6+0.8*($R416)),0)","v":0},{"$f":"IF(G$6>0.2*($R416),(G$6-0.2*($R416))^2/(G$6+0.8*($R416)),0)","v":0},{"$f":"Q415+0.1","v":74.999999999999716},3.3333333333333837]
[null,null,null,null,null,null,null,null,null,null,null,null,null,0,0,0,75.09999999999971,3.3155792276964569]
[null,null,null,null,null,null,null,null,null,null,null,null,null,0,0,0,75.199999999999704,3.2978723404255845]
[null,null,null,null,null,null,null,null,null,null,null,null,null,0,0,0,75.299999999999699,3.2802124833997883]
[null,null,null,null,null,null,null,null,null,null,null,null,null,0,0,0,75.399999999999693,3.2625994694960756]
[null,null,null,null,null,null,null,null,null,null,null,null,null,0,0,0,75.499999999999687,3.2450331125828367]
[null,null,null,null,null,null,null,null,null,null,null,null,null,0,0,0,75.599999999999682,3.227513227513283]
[null,null,null,null,null,null,null,null,null,null,null,null,null,0,0,0,75.699999999999676,3.2100396301189473]
[null,null,null,null,null,null,null,null,null,null,null,null,null,0,0,0,75.79999999999967,3.1926121372032235]
[null,null,null,null,null,null,null,null,null,null,null,null,null,0,0,0,75.899999999999665,3.1752305665349727]
[null,null,null,null,null,null,null,null,null,null,null,null,null,0,0,0,75.999999999999659,3.1578947368421648]
[null,null,null,null,null,null,null,null,null,null,null,null,null,0,0,0,76.099999999999653,3.1406044678055789]
[null,null,null,null,null,null,null,null,null,null,null,null,null,0,0,0,76.199999999999648,3.1233595800525542]
[null,null,null,null,null,null,null,null,null,null,null,null,null,0,0,0,76.299999999999642,3.1061598951507818]
[null,null,null,null,null,null,null,null,null,null,null,null,null,0,0,0,76.399999999999636,3.0890052356021567]
[null,null,null,null,null,null,null,null,null,null,null,null,null,0,0,0,76.499999999999631,3.071895424836665]
[null,null,null,null,null,null,null,null,null,null,null,null,null,0,0,0,76.599999999999625,3.0548302872063307]
[null,null,null,null,null,null,null,null,null,null,null,null,null,0,0,0,76.699999999999619,3.0378096479792038]
[null,null,null,null,null,null,null,null,null,null,null,null,null,0,0,0,76.799999999999613,3.0208333333333997]
[null,null,null,null,null,null,null,null,null,null,null,null,null,0,0,0,76.899999999999608,3.0039011703511722]
[null,null,null,null,null,null,null,null,null,null,null,null,null,0,0,0,76.999999999999602,2.9870129870130544]
[null,null,null,null,null,null,null,null,null,null,null,null,null,0,0,0,77.099999999999596,2.9701686121920261]
[null,null,null,null,null,null,null,null,null,null,null,null,null,0,0,0,77.199999999999591,2.9533678756477375]
[null,null,null,null,null,null,null,null,null,null,null,null,null,0,0,0,77.299999999999585,2.9366106080207679]
[null,null,null,null,null,null,null,null,null,null,null,null,null,0,0,0,77.399999999999579,2.9198966408269431]
[null,null,null,null,null,null,null,null,null,null,null,null,null,0,0,0,77.499999999999574,2.9032258064516832]
[null,null,null,null,null,null,null,null,null,null,null,null,null,0,0,0,77.599999999999568,2.8865979381444014]
[null,null,null,null,null,null,null,null,null,null,null,null,null,0,0,0,77.699999999999562,2.8700128700129426]
[null,null,null,null,null,null,null,null,null,null,null,null,null,0,0,0,77.799999999999557,2.8534704370180677]
[null,null,null,null,null,null,null,null,null,null,null,null,null,0,0,0,77.899999999999551,2.8369704749679823]
[null,null,null,null,null,null,null,null,null,null,null,null,null,0,0,0,77.999999999999545,2.8205128205128958]
[null,null,null,null,null,null,null,null,null,null,null,null,null,0,0,0,78.09999999999954,2.8040973111396408]
[null,null,null,null,null,null,null,null,null,null,null,null,null,0,0,0,78.199999999999534,2.7877237851663175]
[null,null,null,null,null,null,null,null,null,null,null,null,null,0,0,0,78.299999999999528,2.7713920817369857]
[null,null,null,null,null,null,null,null,null,null,null,null,null,0,0,0,78.399999999999523,2.7551020408164035]
[null,null,null,null,null,null,null,null,null,null,null,null,null,0,0,0,78.499999999999517,2.7388535031847923]
[null,null,null,null,null,null,null,null,null,null,null,null,null,0,0,0,78.599999999999511,2.7226463104326495]
[null,null,null,null,null,null,null,null,null,null,null,null,null,0,0,0,78.699999999999505,2.7064803049556065]
[null,null,null,null,null,null,null,null,null,null,null,null,null,0,0,0,78.7999999999995,2.6903553299493197]
[null,null,null,null,null,null,null,null,null,null,null,null,null,0,0,0,78.899999999999494,2.6742712294043898]
[null,null,null,null,null,null,null,null,null,null,null,null,null,0,0,0,78.999999999999488,2.6582278481013475]
[null,null,null,null,null,null,null,null,null,null,null,null,null,0,0,0,79.099999999999483,2.6422250316056459]
[null,null,null,null,null,null,null,null,null,null,null,null,null,0,0,0,79.199999999999477,2.6262626262627098]
[null,null,null,null,null,null,null,null,null,null,null,null,null,0,0,0,79.299999999999471,2.610340479193022]
[null,null,null,null,null,null,null,null,null,null,null,null,null,0,0,0,79.399999999999466,2.5944584382872389]
[null,null,null,null,null,null,null,null,null,null,null,null,null,0,0,0,79.49999999999946,2.5786163522013439]
[null,null,null,null,null,null,null,null,null,null,null,null,null,0,0,0,79.599999999999454,2.5628140703518447]
[null,null,null,null,null,null,null,null,null,null,null,null,null,0,0,0,79.699999999999449,2.5470514429110036]
[null,null,null,null,null,null,null,null,null,null,null,null,null,0,0,0,79.799999999999443,2.5313283208020927]
[null,null,null,null,null,null,null,null,null,null,null,null,null,0,0,0,79.899999999999437,2.5156445556947062]
[null,null,null,null,null,null,null,null,null,null,null,null,null,0,0,0,79.999999999999432,2.5000000000000888]
[null,null,null,null,null,null,null,null,null,null,null,null,null,0,0,0,80.099999999999426,2.4843945068665061]
[null,null,null,null,null,null,null,null,null,null,null,null,null,0,0,0,80.19999999999942,2.468827930174653]
[null,null,null,null,null,null,null,null,null,null,null,null,null,0,0,0,80.299999999999415,2.4533001245330919]
[null,null,null,null,null,null,null,null,null,null,null,null,null,0,0,0,80.399999999999409,2.4378109452737231]
[null,null,null,null,null,null,null,null,null,null,null,null,null,0,0,0,80.499999999999403,2.4223602484472977]
[null,null,null,null,null,null,null,null,null,null,null,null,null,0,0,0,80.599999999999397,2.4069478908189517]
[null,null,null,null,null,null,null,null,null,null,null,null,null,0,0,0,80.699999999999392,2.3915737298637865]
[null,null,null,null,null,null,null,null,null,null,null,null,null,0,0,0,80.799999999999386,2.3762376237624707]
[null,null,null,null,null,null,null,null,null,null,null,null,null,0,0,0,80.89999999999938,2.360939431396881]
[null,null,null,null,null,null,null,null,null,null,null,null,null,0,0,0,80.999999999999375,2.3456790123457747]
[null,null,null,null,null,null,null,null,null,null,null,null,null,0,0,0,81.099999999999369,2.3304562268804911]
[null,null,null,null,null,null,null,null,null,null,null,null,null,0,0,0,81.199999999999363,2.3152709359606884]
[null,null,null,null,null,null,null,null,null,null,null,null,null,0,0,0,81.299999999999358,{"$f":"IF(Q479>0,1000/Q479-10,1000)","v":2.3001230012301086}]
[null,null,null,null,null,null,null,null,null,null,null,null,null,{"$f":"IF(E$6>0.2*($R480),(E$6-0.2*($R480))^2/(E$6+0.8*($R480)),0)","v":0},{"$f":"IF(F$6>0.2*($R480),(F$6-0.2*($R480))^2/(F$6+0.8*($R480)),0)","v":0},{"$f":"IF(G$6>0.2*($R480),(G$6-0.2*($R480))^2/(G$6+0.8*($R480)),0)","v":0},{"$f":"Q479+0.1","v":81.399999999999352},2.2850122850123835]
[null,null,null,null,null,null,null,null,null,null,null,null,null,0,0,0,81.499999999999346,2.2699386503068464]
[null,null,null,null,null,null,null,null,null,null,null,null,null,0,0,0,81.599999999999341,2.2549019607844123]
[null,null,null,null,null,null,null,null,null,null,null,null,null,0,0,0,81.699999999999335,2.2399020807834535]
[null,null,null,null,null,null,null,null,null,null,null,null,null,0,0,0,81.799999999999329,2.2249388753057229]
[null,null,null,null,null,null,null,null,null,null,null,null,null,0,0,0,81.899999999999324,2.2100122100123105]
[null,null,null,null,null,null,null,null,null,null,null,null,null,0,0,0,81.999999999999318,2.1951219512196136]
[null,null,null,null,null,null,null,null,null,null,null,null,null,0,0,0,82.099999999999312,2.1802679658953519]
[null,null,null,null,null,null,null,null,null,null,null,null,null,0,0,0,82.199999999999307,2.1654501216546045]
[null,null,null,null,null,null,null,null,null,null,null,null,null,0,0,0,82.299999999999301,2.1506682867558755]
[null,null,null,null,null,null,null,null,null,null,null,null,null,0,0,0,82.399999999999295,2.1359223300971912]
[null,null,null,null,null,null,null,null,null,null,null,null,null,0,0,0,82.499999999999289,2.1212121212122259]
[null,null,null,null,null,null,null,null,null,null,null,null,null,0,0,0,82.599999999999284,2.1065375302664489]
[null,null,null,null,null,null,null,null,null,null,null,null,null,0,0,0,82.699999999999278,2.0918984280533106]
[null,null,null,null,null,null,null,null,null,null,null,null,null,0,0,0,82.799999999999272,2.0772946859904451]
[null,null,null,null,null,null,null,null,null,null,null,null,null,0,0,0,82.899999999999267,2.062726176115909]
[null,null,null,null,null,null,null,null,null,null,null,null,null,0,0,0,82.999999999999261,2.0481927710844445]
[null,null,null,null,null,null,null,null,null,null,null,null,null,0,0,0,83.099999999999255,2.0336943441637665]
[null,null,null,null,null,null,null,null,null,null,null,null,null,0,0,0,83.19999999999925,2.0192307692308784]
[null,null,null,null,null,null,null,null,null,null,null,null,null,0,0,0,83.299999999999244,2.0048019207684167]
[null,null,null,null,null,null,null,null,null,null,null,null,null,0,0,0,83.399999999999238,1.9904076738610215]
[null,null,null,null,null,null,null,null,null,null,null,null,null,0,0,0,83.499999999999233,1.9760479041917272]
[null,null,null,null,null,null,null,null,null,null,null,null,null,0,0,0,83.599999999999227,1.9617224880383883]
[null,null,null,null,null,null,null,null,null,null,null,null,null,0,0,0,83.699999999999221,1.9474313022701235]
[null,null,null,null,null,null,null,null,null,null,null,null,null,0,0,0,83.799999999999216,1.9331742243437873]
[null,null,null,null,null,null,null,null,null,null,null,null,null,0,0,0,83.89999999999921,1.9189511323004691]
[null,null,null,null,null,null,null,null,null,null,null,null,null,0,0,0,83.999999999999204,1.904761904762017]
[null,null,null,null,null,null,null,null,null,null,null,null,null,0,0,0,84.099999999999199,1.8906064209275808]
[null,null,null,null,null,null,null,null,null,null,null,null,null,0,0,0,84.199999999999193,1.8764845605701854]
[null,null,null,null,null,null,null,null,null,null,null,null,null,0,0,0,84.299999999999187,1.8623962040333293]
[null,null,null,null,null,null,null,null,null,null,null,null,null,0,0,0,84.399999999999181,1.8483412322276038]
[null,null,null,null,null,null,null,null,null,null,null,null,null,0,0,0,84.499999999999176,1.8343195266273344]
[null,null,null,null,null,null,null,null,null,null,null,null,null,0,0,0,84.59999999999917,1.8203309692672551]
[null,null,null,null,null,null,null,null,null,null,null,null,null,0,0,0,84.699999999999164,1.8063754427391956]
[null,null,null,null,null,null,null,null,null,null,null,null,null,0,0,0,84.799999999999159,1.7924528301887968]
[null,null,null,null,null,null,null,null,null,null,null,null,null,0,0,0,84.899999999999153,1.7785630153122494]
[null,null,null,null,null,null,null,null,null,null,null,null,null,0,0,0,84.999999999999147,1.7647058823530593]
[null,null,null,null,null,null,null,null,null,null,null,null,null,0,0,0,85.099999999999142,1.7508813160988268]
[null,null,null,null,null,null,null,null,null,null,null,null,null,0,0,0,85.199999999999136,1.737089201878053]
[null,null,null,null,null,null,null,null,null,null,null,null,null,0,0,0,85.29999999999913,1.7233294255569778]
[null,null,null,null,null,null,null,null,null,null,null,null,null,0,0,0,85.399999999999125,1.7096018735364193]
[null,null,null,null,null,null,null,null,null,null,null,null,null,0,0,0,85.499999999999119,1.695906432748659]
[null,null,null,null,null,null,null,null,null,null,null,null,null,0,0,0,85.599999999999113,1.682242990654327]
[null,null,null,null,null,null,null,null,null,null,null,null,null,0,0,0,85.699999999999108,1.6686114352393275]
[null,null,null,null,null,null,null,null,null,null,null,null,null,0,0,0,85.799999999999102,1.6550116550117764]
[null,null,null,null,null,null,null,null,null,null,null,null,null,0,0,0,85.899999999999096,1.6414435389989581]
[null,null,null,null,null,null,null,null,null,null,null,null,null,0,0,0,85.999999999999091,1.6279069767443097]
[null,null,null,null,null,null,null,null,null,null,null,null,null,0,0,0,86.099999999999085,1.6144018583044204]
[null,null,null,null,null,null,null,null,null,null,null,null,null,0,0,0,86.199999999999079,1.6009280742460632]
[null,null,null,null,null,null,null,null,null,null,null,null,null,0,0,0,86.299999999999073,1.5874855156432304]
[null,null,null,null,null,null,null,null,null,null,null,null,null,0,0,0,86.399999999999068,1.5740740740741987]
[null,null,null,null,null,null,null,null,null,null,null,null,null,0,0,0,86.499999999999062,1.5606936416186219]
[null,null,null,null,null,null,null,null,null,null,null,null,null,0,0,0,86.599999999999056,1.5473441108546293]
[null,null,null,null,null,null,null,null,null,null,null,null,null,0,0,0,86.699999999999051,1.5340253748559505]
[null,null,null,null,null,null,null,null,null,null,null,null,null,0,0,0,86.799999999999045,1.5207373271890674]
[null,null,null,null,null,null,null,null,null,null,null,null,null,0,0,0,86.899999999999039,1.5074798619103689]
[null,null,null,null,null,null,null,null,null,null,null,null,null,0,0,0,86.999999999999034,1.4942528735633456]
[null,null,null,null,null,null,null,null,null,null,null,null,null,0,0,0,87.099999999999028,1.4810562571757888]
[null,null,null,null,null,null,null,null,null,null,null,null,null,0,0,0,87.199999999999022,1.4678899082570087]
[null,null,null,null,null,null,null,null,null,null,null,null,null,0,0,0,87.299999999999017,1.4547537227950897]
[null,null,null,null,null,null,null,null,null,null,null,null,null,0,0,0,87.399999999999011,1.4416475972541338]
[null,null,null,null,null,null,null,null,null,null,null,null,null,0,0,0,87.499999999999005,1.4285714285715585]
[null,null,null,null,null,null,null,null,null,null,null,null,null,0,0,0,87.599999999999,1.4155251141553808]
[null,null,null,null,null,null,null,null,null,null,null,null,null,0,0,0,87.699999999998994,{"$f":"IF(Q543>0,1000/Q543-10,1000)","v":1.4025085518815441}]
[null,null,null,null,null,null,null,null,null,null,null,null,null,{"$f":"IF(E$6>0.2*($R544),(E$6-0.2*($R544))^2/(E$6+0.8*($R544)),0)","v":0},{"$f":"IF(F$6>0.2*($R544),(F$6-0.2*($R544))^2/(F$6+0.8*($R544)),0)","v":0},{"$f":"IF(G$6>0.2*($R544),(G$6-0.2*($R544))^2/(G$6+0.8*($R544)),0)","v":0},{"$f":"Q543+0.1","v":87.799999999998988},1.3895216400912478]
[null,null,null,null,null,null,null,null,null,null,null,null,null,0,0,0,87.899999999998983,1.3765642775883009]
[null,null,null,null,null,null,null,null,null,null,null,null,null,0,0,0,87.999999999998977,1.3636363636364965]
[null,null,null,null,null,null,null,null,null,null,null,null,null,0,0,0,88.099999999998971,1.3507377979570006]
[null,null,null,null,null,null,null,null,null,null,null,null,null,0,0,0,88.199999999998965,1.3378684807257564]
[null,null,null,null,null,null,null,null,null,null,null,null,null,0,0,0,88.29999999999896,1.3250283125709146]
[null,null,null,null,null,null,null,null,null,null,null,null,null,0,0,0,88.399999999998954,1.3122171945702696]
[null,null,null,null,null,null,null,null,null,null,null,null,null,0,0,0,88.499999999998948,1.2994350282487215]
[null,null,null,null,null,null,null,null,null,null,null,null,null,0,0,0,88.599999999998943,1.2866817155757548]
[null,null,null,null,null,null,null,null,null,null,null,null,null,0,0,0,88.699999999998937,1.273957158962931]
[null,null,null,null,null,null,null,null,null,null,null,null,null,0,0,0,88.799999999998931,1.2612612612613976]
[null,null,null,null,null,null,null,null,null,null,null,null,null,0,0,0,88.899999999998926,1.2485939257594154]
[null,null,null,null,null,null,null,null,null,null,null,null,null,0,0,0,88.99999999999892,1.2359550561799111]
[null,null,null,null,null,null,null,null,null,null,null,null,null,0,0,0,89.099999999998914,1.2233445566780272]
[null,null,null,null,null,null,null,null,null,null,null,null,null,0,0,0,89.199999999998909,1.2107623318387031]
[null,null,null,null,null,null,null,null,null,null,null,null,null,0,0,0,89.299999999998903,1.1982082866742694]
[null,null,null,null,null,null,null,null,null,null,null,null,null,0,0,0,89.399999999998897,1.1856823266220626]
[null,null,null,null,null,null,null,null,null,null,null,null,null,0,0,0,89.499999999998892,1.1731843575420378]
[null,null,null,null,null,null,null,null,null,null,null,null,null,0,0,0,89.599999999998886,1.160714285714425]
[null,null,null,null,null,null,null,null,null,null,null,null,null,0,0,0,89.69999999999888,1.1482720178373746]
[null,null,null,null,null,null,null,null,null,null,null,null,null,0,0,0,89.799999999998875,1.1358574610246386]
[null,null,null,null,null,null,null,null,null,null,null,null,null,0,0,0,89.899999999998869,1.1234705228032542]
[null,null,null,null,null,null,null,null,null,null,null,null,null,0,0,0,89.999999999998863,1.111111111111251]
[null,null,null,null,null,null,null,null,null,null,null,null,null,0,0,0,90.099999999998857,1.0987791342953681]
[null,null,null,null,null,null,null,null,null,null,null,null,null,0,0,0,90.199999999998852,1.0864745011087891]
[null,null,null,null,null,null,null,null,null,null,null,null,null,0,0,0,90.299999999998846,1.0741971207088898]
[null,null,null,null,null,null,null,null,null,null,null,null,null,0,0,0,90.39999999999884,1.0619469026550092]
[null,null,null,null,null,null,null,null,null,null,null,null,null,0,0,0,90.499999999998835,1.0497237569062197]
[null,null,null,null,null,null,null,null,null,null,null,null,null,0,0,0,90.599999999998829,1.037527593819128]
[null,null,null,null,null,null,null,null,null,null,null,null,null,0,0,0,90.699999999998823,1.0253583241456781]
[null,null,null,null,null,null,null,null,null,null,null,null,null,0,0,0,90.799999999998818,1.0132158590309803]
[null,null,null,null,null,null,null,null,null,null,null,null,null,0,0,0,90.899999999998812,1.0011001100111443]
[null,null,null,null,null,null,null,null,null,null,null,null,null,0,0,0,90.999999999998806,0.98901098901113293]
[null,null,null,null,null,null,null,null,null,null,null,null,null,0,0,0,91.099999999998801,0.97694840834262564]
[null,null,null,null,null,null,null,null,null,null,null,null,null,0,0,0,91.199999999998795,0.96491228070189905]
[null,null,null,null,null,null,null,null,null,null,null,null,null,0,0,0,91.299999999998789,0.95290251916772384]
[null,null,null,null,null,null,null,null,null,null,null,null,null,0,0,0,91.399999999998784,0.94091903719927039]
[null,null,null,null,null,null,null,null,null,null,null,null,null,0,0,0,91.499999999998778,0.92896174863402514]
[null,null,null,null,null,null,null,null,null,null,null,null,null,0,0,0,91.599999999998772,0.91703056768573532]
[null,null,null,null,null,null,null,null,null,null,null,null,null,0,0,0,91.699999999998766,0.90512540894235016]
[null,null,null,null,null,null,null,null,null,null,null,null,null,0,0,0,91.799999999998761,0.89324618736398165]
[null,null,null,null,null,null,null,null,null,null,null,null,null,0,0,0,91.899999999998755,0.88139281828088656]
[null,null,null,null,null,null,null,null,null,null,null,null,null,0,0,0,91.999999999998749,0.86956521739145209]
[null,null,null,null,null,null,null,null,null,null,null,null,null,0,0,0,92.099999999998744,0.85776330076019214]
[null,null,null,null,null,null,null,null,null,null,null,null,null,0,0,0,92.199999999998738,0.84598698481576662]
[null,null,null,null,null,null,null,null,null,null,null,null,null,0,0,0,92.299999999998732,0.83423618634901153]
[null,null,null,null,null,null,null,null,null,null,null,null,null,0,0,0,92.399999999998727,0.82251082251097252]
[null,null,null,null,null,null,null,null,null,null,null,null,null,0,0,0,92.499999999998721,0.81081081081095974]
[null,null,null,null,null,null,null,null,null,null,null,null,null,0,0,0,92.599999999998715,0.79913606911462054]
[null,null,null,null,null,null,null,null,null,null,null,null,null,0,0,0,92.69999999999871,0.787486515642005]
[null,null,null,null,null,null,null,null,null,null,null,null,null,0,0,0,92.799999999998704,0.77586206896566701]
[null,null,null,null,null,null,null,null,null,null,null,null,null,0,0,0,92.899999999998698,0.76426264800876176]
[null,null,null,null,null,null,null,null,null,null,null,null,null,0,0,0,92.999999999998693,0.75268817204316107]
[null,null,null,null,null,null,null,null,null,null,null,null,null,0,0,0,93.099999999998687,0.74113856068758466]
[null,null,null,null,null,null,null,null,null,null,null,null,null,0,0,0,93.199999999998681,0.72961373390573137]
[null,null,null,null,null,null,null,null,null,null,null,null,null,0,0,0,93.299999999998676,0.71811361200443891]
[null,null,null,null,null,null,null,null,null,null,null,null,null,0,0,0,93.39999999999867,0.70663811563184353]
[null,null,null,null,null,null,null,null,null,null,null,null,null,0,0,0,93.499999999998664,0.69518716577555395]
[null,null,null,null,null,null,null,null,null,null,null,null,null,0,0,0,93.599999999998658,0.68376068376083765]
[null,null,null,null,null,null,null,null,null,null,null,null,null,0,0,0,93.699999999998653,0.67235859124881969]
[null,null,null,null,null,null,null,null,null,null,null,null,null,0,0,0,93.799999999998647,0.66098081023469568]
[null,null,null,null,null,null,null,null,null,null,null,null,null,0,0,0,93.899999999998641,0.64962726304594831]
[null,null,null,null,null,null,null,null,null,null,null,null,null,0,0,0,93.999999999998636,0.63829787234057989]
[null,null,null,null,null,null,null,null,null,null,null,null,null,0,0,0,94.09999999999863,{"$f":"IF(Q607>0,1000/Q607-10,1000)","v":0.62699256110536261}]
[null,null,null,null,null,null,null,null,null,null,null,null,null,{"$f":"IF(E$6>0.2*($R608),(E$6-0.2*($R608))^2/(E$6+0.8*($R608)),0)","v":0},{"$f":"IF(F$6>0.2*($R608),(F$6-0.2*($R608))^2/(F$6+0.8*($R608)),0)","v":0},{"$f":"IF(G$6>0.2*($R608),(G$6-0.2*($R608))^2/(G$6+0.8*($R608)),0)","v":0},{"$f":"Q607+0.1","v":94.199999999998624},0.61571125265408355]
[null,null,null,null,null,null,null,null,null,null,null,null,null,0,0,0,94.299999999998619,0.60445387062581801]
[null,null,null,null,null,null,null,null,null,null,null,null,null,0,0,0,94.399999999998613,0.59322033898320647]
[null,null,null,null,null,null,null,null,null,null,null,null,null,0,0,0,94.499999999998607,0.58201058201073863]
[null,null,null,null,null,null,null,null,null,null,null,null,null,0,0,0,94.599999999998602,0.57082452431305342]
[null,null,null,null,null,null,null,null,null,null,null,null,null,0,0,0,94.699999999998596,0.55966209081324969]
[null,null,null,null,null,null,null,null,null,null,null,null,null,0,0,0,94.79999999999859,0.54852320675121113]
[null,null,null,null,null,null,null,null,null,null,null,null,null,0,0,0,94.899999999998585,0.53740779768192759]
[null,null,null,null,null,null,null,null,null,null,null,null,null,0,0,0,94.999999999998579,0.52631578947384128]
[null,null,null,null,null,null,null,null,null,null,null,null,null,0,0,0,95.099999999998573,0.51524710830720366]
[null,null,null,null,null,null,null,null,null,null,null,null,null,0,0,0,95.199999999998568,0.50420168067242699]
[null,null,null,null,null,null,null,null,null,null,null,null,null,0,0,0,95.299999999998562,0.49317943336846959]
[null,null,null,null,null,null,null,null,null,null,null,null,null,0,0,0,95.399999999998556,0.48218029350120695]
[null,null,null,null,null,null,null,null,null,null,null,null,null,0,0,0,95.49999999999855,0.47120418848183476]
[null,null,null,null,null,null,null,null,null,null,null,null,null,0,0,0,95.599999999998545,0.46025104602526312]
[null,null,null,null,null,null,null,null,null,null,null,null,null,0,0,0,95.699999999998539,0.44932079414853909]
[null,null,null,null,null,null,null,null,null,null,null,null,null,0,0,0,95.799999999998533,0.43841336116926222]
[null,null,null,null,null,null,null,null,null,null,null,null,null,0,0,0,95.899999999998528,0.42752867570401776]
[null,null,null,null,null,null,null,null,null,null,null,null,null,0,0,0,95.999999999998522,0.41666666666682772]
[null,null,null,null,null,null,null,null,null,null,null,null,null,0,0,0,96.099999999998516,0.40582726326759122]
[null,null,null,null,null,null,null,null,null,null,null,null,null,0,0,0,96.199999999998511,0.39501039501055679]
[null,null,null,null,null,null,null,null,null,null,null,null,null,0,0,0,96.299999999998505,0.38421599169278764]
[null,null,null,null,null,null,null,null,null,null,null,null,null,0,0,0,96.399999999998499,0.37344398340265172]
[null,null,null,null,null,null,null,null,null,null,null,null,null,0,0,0,96.499999999998494,0.36269430051829588]
[null,null,null,null,null,null,null,null,null,null,null,null,null,0,0,0,96.599999999998488,0.35196687370616608]
[null,null,null,null,null,null,null,null,null,null,null,null,null,0,0,0,96.699999999998482,0.34126163391950115]
[null,null,null,null,null,null,null,null,null,null,null,null,null,0,0,0,96.799999999998477,0.33057851239685654]
[null,null,null,null,null,null,null,null,null,null,null,null,null,0,0,0,96.899999999998471,0.3199174406606371]
[null,null,null,null,null,null,null,null,null,null,null,null,null,0,0,0,96.999999999998465,0.30927835051562624]
[null,null,null,null,null,null,null,null,null,null,null,null,null,0,0,0,97.09999999999846,0.29866117404753645]
[null,null,null,null,null,null,null,null,null,null,null,null,null,0,0,0,97.199999999998454,0.28806584362156329]
[null,null,null,null,null,null,null,null,null,null,null,null,null,0,0,0,97.299999999998448,0.27749229188094482]
[null,null,null,null,null,null,null,null,null,null,null,null,null,0,0,0,97.399999999998442,0.26694045174554404]
[null,null,null,null,null,null,null,null,null,null,null,null,null,0,0,0,97.499999999998437,0.2564102564104207]
[null,null,null,null,null,null,null,null,null,null,null,null,null,0,0,0,97.599999999998431,0.24590163934442621]
[null,null,null,null,null,null,null,null,null,null,null,null,null,0,0,0,97.699999999998425,0.23541453428880388]
[null,null,null,null,null,null,null,null,null,null,null,null,null,0,0,0,97.79999999999842,0.2249488752557891]
[null,null,null,null,null,null,null,null,null,null,null,null,null,0,0,0,97.899999999998414,0.21450459652723453]
[null,null,null,null,null,null,null,null,null,null,null,null,null,0,0,0,97.999999999998408,0.20408163265322621]
[null,null,null,null,null,null,null,null,null,null,null,null,null,0,0,0,98.099999999998403,0.19367991845072652]
[null,null,null,null,null,null,null,null,null,null,null,null,null,0,0,0,98.199999999998397,0.18329938900220277]
[null,null,null,null,null,null,null,null,null,null,null,null,null,0,0,0,98.299999999998391,0.17293997965428609]
[null,null,null,null,null,null,null,null,null,null,null,null,null,0,0,0,98.399999999998386,0.16260162601642669]
[null,null,null,null,null,null,null,null,null,null,null,null,null,0,0,0,98.49999999999838,0.15228426395955807]
[null,null,null,null,null,null,null,null,null,null,null,null,null,0,0,0,98.599999999998374,0.14198782961477185]
[null,null,null,null,null,null,null,null,null,null,null,null,null,0,0,0,98.699999999998369,0.13171225937200148]
[null,null,null,null,null,null,null,null,null,null,null,null,null,0,0,0,98.799999999998363,0.12145748987870952]
[null,null,null,null,null,null,null,null,null,null,null,null,null,0,0,0,98.899999999998357,0.11122345803859091]
[null,null,null,null,null,null,null,null,null,null,null,null,null,0,0,0,98.999999999998352,0.10101010101026908]
[null,null,null,null,null,null,null,null,null,null,null,null,null,0,0,0,99.099999999998346,9.0817356206020605E-2]
[null,null,null,null,null,null,null,null,null,null,null,null,null,0,0,0,99.19999999999834,8.0645161290490819E-2]
[null,null,null,null,null,null,null,null,null,null,null,null,null,0,0,0,99.299999999998334,7.0493454179423765E-2]
[null,null,null,null,null,null,null,null,null,null,null,null,null,0,0,0,99.399999999998329,6.0362173038399192E-2]
[null,null,null,null,null,null,null,null,null,null,null,null,null,0,0,0,99.499999999998323,5.0251256281576673E-2]
[null,null,null,null,null,null,null,null,null,null,null,null,null,0,0,0,99.599999999998317,4.0160642570450378E-2]
[null,null,null,null,null,null,null,null,null,null,null,null,null,0,0,0,99.699999999998312,3.00902708126074E-2]
[null,null,null,null,null,null,null,null,null,null,null,null,null,0,0,0,99.799999999998306,2.0040080160491414E-2]
[null,null,null,null,null,null,null,null,null,null,null,null,null,0,0,0,99.8999999999983,1.0010010010180537E-2]
[null,null,null,null,null,null,null,null,null,null,null,null,null,0,0,0,99.999999999998295,1.7053025658242404E-13]

{"sheet":"Summary","index":10,"n_rows":92,"n_cols":11,"rows_kept":92,"cut":false,"hidden":false,"merged":[[89,1,91,1],[83,1,85,1],[86,1,88,1],[4,1,4,4],[5,1,5,4],[6,2,6,3],[30,2,30,3],[32,2,32,3],[34,2,34,5],[35,2,35,5],[39,1,40,2],[39,3,40,3],[48,1,48,2],[5,8,8,9],[7,2,7,3],[27,2,27,3],[28,2,28,3],[29,2,29,3]]}
[]
[null,{"$f":"Site!E1","v":"DEQ Virginia Runoff Reduction Method Re-Development Compliance Spreadsheet  - Version 4.1 "}]
[]
[null,{"$f":"Site!G11","v":"BMP Design Specifications List:"},{"$f":"Site!J11","v":"2024 Stds & Specs"}]
[null,{"$f":"IF(Site!E6=\"Yes\",\"Site Summary - Linear Development Project***\",\"Site Summary\")","v":"Site Summary"}]
[null,{"$f":"IF(Site!B4=\"\",\"Project Title: NA\",\"Project Title: \" &Site!B4)","v":"Project Title: NA"}]
[null,{"$f":"IF(Site!B5=\"\",\"Date: NA\",\"Date: \" &Site!B5)","v":"Date: NA"}]
[null,null,"Total Disturbed Acreage: ",null,{"$f":"Site!F10","v":0}]
[]
[null,"Site Land Cover Summary",{"$f":"IF(Site!G10=\"←\", \"DISTURBED ACREAGE NOT ENTERED ON SITE TAB!\",IF(Site!F10>Site!F29,\"TOTAL DISTURBED ACREAGE GREATER THAN POST-DEVELOPMENT AREA IN SITE TAB!\",\"\"))","v":""}]
[]
[null,"Pre-ReDevelopment Land Cover  (acres)"]
[null,null,"A soils","B Soils","C Soils","D Soils","Totals","% of Total"]
[null,"Forest (acres)",{"$f":"Site!B17","v":0},{"$f":"Site!C17","v":0},{"$f":"Site!D17","v":0},{"$f":"Site!E17","v":0},{"$f":"Site!F17","v":0},{"$f":"IF(G$18>0,G14/G$18*100,0)","v":0}]
[null,"Mixed Open (acres)",{"$f":"Site!B18","v":0},{"$f":"Site!C18","v":0},{"$f":"Site!D18","v":0},{"$f":"Site!E18","v":0},{"$f":"Site!F18","v":0},{"$f":"IF(G$18>0,G15/G$18*100,0)","v":0}]
[null,"Managed Turf (acres)",{"$f":"Site!B19","v":0},{"$f":"Site!C19","v":0},{"$f":"Site!D19","v":0},{"$f":"Site!E19","v":0},{"$f":"Site!F19","v":0},{"$f":"IF(G$18>0,G16/G$18*100,0)","v":0}]
[null,"Impervious Cover (acres)",{"$f":"Site!B20","v":0},{"$f":"Site!C20","v":0},{"$f":"Site!D20","v":0},{"$f":"Site!E20","v":0},{"$f":"Site!F20","v":0},{"$f":"IF(G$18>0,G17/G$18*100,0)","v":0}]
[null,null,null,null,null,null,{"$f":"Site!F21","v":0},{"$f":"SUM(H14:H17)","v":0}]
[]
[null,"Post-ReDevelopment Land Cover  (acres)"]
[null,null,"A soils","B Soils","C Soils","D Soils","Totals","% of Total"]
[null,"Forest (acres)",{"$f":"Site!B25","v":0},{"$f":"Site!C25","v":0},{"$f":"Site!D25","v":0},{"$f":"Site!E25","v":0},{"$f":"Site!F25","v":0},{"$f":"IF(G$18>0,G22/G$26*100,0)","v":0},{"$f":"IF(Site!F25>0,\"*\",\"\")","v":""}]
[null,"Mixed Open (acres)",{"$f":"Site!B26","v":0},{"$f":"Site!C26","v":0},{"$f":"Site!D26","v":0},{"$f":"Site!E26","v":0},{"$f":"Site!F26","v":0},{"$f":"IF(G$18>0,G23/G$26*100,0)","v":0}]
[null,"Managed Turf (acres)",{"$f":"Site!B27","v":0},{"$f":"Site!C27","v":0},{"$f":"Site!D27","v":0},{"$f":"Site!E27","v":0},{"$f":"Site!F27","v":0},{"$f":"IF(G$18>0,G24/G$26*100,0)","v":0}]
[null,"Impervious Cover (acres)",{"$f":"Site!B28","v":0},{"$f":"Site!C28","v":0},{"$f":"Site!D28","v":0},{"$f":"Site!E28","v":0},{"$f":"Site!F28","v":0},{"$f":"IF(G$18>0,G25/G$26*100,0)","v":0}]
[null,{"$f":"IF(Site!F24>0,\"* Forest/Open Space areas must be protected in accordance with the Virginia Runoff Reduction Method\",\"\")","v":"* Forest/Open Space areas must be protected in accordance with the Virginia Runoff Reduction Method"},null,null,null,null,{"$f":"Site!F29","v":0},{"$f":"SUM(H22:H25)","v":0}]
[null,"Site Tv and Land Cover Nutrient Loads"]
[null,null,"Final Post-Development \n(Post-ReDevelopment \n& New Impervious)",null,"Post-ReDevelopment","Post-Development (New Impervious)","Adjusted Pre-ReDevelopment",null,{"$f":"Site!A66","v":"Pre-ReDevelopment TP Load per acre\n(lb/acre/yr)"},{"$f":"Site!E66","v":"Final Post-Development TP Load per acre \n(lb/acre/yr)"},{"$f":"Site!H66","v":"Post-ReDevelopment TP Load per acre \n(lb/acre/yr)"}]
[null,"Site Rv",{"$f":"Site!F61","v":"--"},null,{"$f":"Site!I61","v":"--"},{"$f":"Site!L61","v":0},{"$f":"Site!C61","v":"--"},null,{"$f":"Site!C66","v":"--"},{"$f":"Site!F66","v":"--"},{"$f":"Site!I66","v":"--"}]
[null,"Treatment Volume (ft3) ",{"$f":"Site!F64","v":"--"},null,{"$f":"Site!I64","v":"--"},{"$f":"Site!L64","v":"--"},{"$f":"Site!C64","v":"--"}]
[null,"TP Load (lb/yr)",{"$f":"Site!F65","v":"--"},null,{"$f":"Site!I65","v":"--"},{"$f":"Site!L65","v":"--"},{"$f":"Site!C65","v":"--"}]
[null,null,null,{"$f":"IF(Site!D56=\"*\",\"Baseline TP Load (lb/yr):\",\"\")","v":""},{"$f":"IF(Site!D56=\"*\",Site!C58&\"*\",\"\")","v":""},{"$f":"IF(Site!D56=\"*\",\"*Reduction below new development load limitation not required\",\"\")","v":""}]
[null,"Total TP Load Reduction Required (lb/yr)",{"$f":"IF(Site!G33=\"--\",\"--\",IF(Site!$G$33=Site!$O$2,\"Check Areas!\",IF(Site!$E6=\"yes\",ROUND(Site!$G$34,2),Site!$G$33)))","v":"--"},null,{"$f":"IF(Site!$E6=\"yes\",\"N/A***\",IF(Site!I69=Site!$O$3,\"x\",Site!I69))","v":"--"},{"$f":"IF(Site!$E6=\"yes\",\"N/A***\",IF(Site!$L$69=Site!$O$3,\"x\",Site!$L$69))","v":"--"}]
[null,null,{"$f":"IF(Site!E6=\"yes\",\"***This is a linear development project\",\"\")","v":""}]
[null,null,"Final Post-Development Load \n(Post-ReDevelopment & New Impervious) ",null,null,null,"Pre-ReDevelopment"]
[null,"TN Load (lb/yr)",{"$f":"Site!J37","v":"--"},null,null,null,{"$f":"Site!D37","v":"--"}]
[]
[null,{"$f":"IF(C38=\"\",\"Site Compliance Summary\",\"Site Compliance Summary -\")","v":"Site Compliance Summary"},{"$f":"IF(Site!E6=\"yes\",\"***Linear Development Project\",\"\")","v":""}]
[]
[null,"Maximum % Reduction Required Below \nPre-ReDevelopment Load",null,{"$f":"IF(Site!I67=Site!$O$2,\"x\",Site!$I67)","v":"--"},{"$f":"IF(Site!D56=\"*\",\"  * Note: % Reduction will reduce post-development TP load to less than or equal to baseline load of \"&ROUND(Site!C58,2)&\" lb/yr (0.41 lb/ac/yr)\",\"\")","v":""}]
[null,null,null,null,{"$f":"IF(D32=\"\",\"\",IF(Site!E6=\"yes\",\"[Post-Dev Reduction Requirement = Post-Dev TP load - baseline load of \"&ROUND(Site!C58,2)&\" lb/yr], baseline load = site area x 0.41 lb/ac/yr\",IF(E40=\"\",\"\",\"    [Required reduction for Post-ReDev. = Post-ReDev TP load - baseline load of \"&Site!C58&\" lb/yr], baseline load = site area x 0.41 lb/ac/yr\")))","v":""}]
[]
[]
[null,"Total Runoff Volume Reduction (ft3)  ",{"$f":"'Water Quality Compliance'!G16","v":0},null,{"$f":"IF(AND(E45=E46,E46=E47,Site!P5=0),\"\",IF(Site!P5=\"incomplete\",\"Site tab incomplete\",\"Error Summary:\"))","v":""}]
[null,"Total TP Load Reduction Achieved (lb/yr)",{"$f":"IF(Site!E6=\"yes\",'Water Quality Compliance'!D26,'Water Quality Compliance'!B26)","v":"--"},null,{"$f":"IF(Site!P5=0,\"\",\"Errors on Site tab\")","v":""}]
[null,"Total TN Load Reduction Achieved (lb/yr)",{"$f":"'Water Quality Compliance'!B32","v":"--"},null,{"$f":"IF((COUNTIF(C58:G58,\"\"))=5,\"\",\" Errors on D.A. tab(s)\")","v":""}]
[null,"Remaining Post Development TP Load (lb/yr)",{"$f":"IFERROR(C31-C45,\"--\")","v":"--"},null,{"$f":"IF(OR(I53=\"X\", I55=\"X\",I56=\"X\"),\" Areas on D.A. tab(s) exceed Site tab areas\",\"\")","v":""}]
[null,"Remaining TP Load Reduction (lb/yr) Required",{"$f":"IFERROR(IF(AND(E45=E46,E46=E47),(IF(Site!E6=\"yes\",'Water Quality Compliance'!D28,'Water Quality Compliance'!B28)),\"Check Errors!\"),\"--\")","v":"--"},{"$f":"IF(C46=\"Check Errors!\",\"\",IF(Site!E6=\"no\",'Water Quality Compliance'!A29,'Water Quality Compliance'!E28))","v":""}]
[null,{"$f":"F32","v":""},null,{"$f":"IFERROR(IF(AND(C33-C45<0.005,C45<C33),\"      (Remaining TP load reduction <0.005)\",\"\"),\"\")","v":""}]
[null,"Drainage Area Summary"]
[]
[null,null,"D.A. A","D.A. B","D.A. C","D.A. D","D.A. E","Total"]
[null,"Forest (acres)",{"$f":"'D.A. A'!F5","v":0},{"$f":"'D.A. B'!F5","v":0},{"$f":"'D.A. C'!F5","v":0},{"$f":"'D.A. D'!F5","v":0},{"$f":"'D.A. E'!F5","v":0},{"$f":"SUM(C53:G53)","v":0},{"$f":"IF(Site!F24<('D.A. A'!F5+'D.A. B'!F5+'D.A. C'!F5+'D.A. D'!F5+'D.A. E'!F5),\"X\",\"\")","v":""}]
[null,"Mixed Open (acres)",{"$f":"'D.A. A'!F6","v":0},{"$f":"'D.A. B'!F6","v":0},{"$f":"'D.A. C'!F6","v":0},{"$f":"'D.A. D'!F6","v":0},{"$f":"'D.A. E'!F6","v":0},{"$f":"SUM(C54:G54)","v":0},{"$f":"IF('Water Quality Compliance'!G4=\"OK.\",\"\",\"X\")","v":""}]
[null,"Managed Turf (acres)",{"$f":"'D.A. A'!F7","v":0},{"$f":"'D.A. B'!F7","v":0},{"$f":"'D.A. C'!F7","v":0},{"$f":"'D.A. D'!F7","v":0},{"$f":"'D.A. E'!F7","v":0},0,{"$f":"IF('Water Quality Compliance'!G6=\"OK.\",\"\",\"X\")","v":""}]
[null,"Impervious Cover (acres)",{"$f":"'D.A. A'!F8","v":0},{"$f":"'D.A. B'!F8","v":0},{"$f":"'D.A. C'!F8","v":0},{"$f":"'D.A. D'!F8","v":0},{"$f":"'D.A. E'!F8","v":0},0,{"$f":"IF('Water Quality Compliance'!G8=\"OK.\",\"\",\"X\")","v":""}]
[null,"Total Area (acres)",{"$f":"SUM(C53:C56)","v":0},{"$f":"SUM(D53:D56)","v":0},{"$f":"SUM(E53:E56)","v":0},{"$f":"SUM(F53:F56)","v":0},{"$f":"SUM(G53:G56)","v":0},{"$f":" SUM(H53:H56)","v":0}]
[null,null,{"$f":"IF('Water Quality Compliance'!B10=\"OK.\",\"\",\"D.A. A Errors!\")","v":""},{"$f":"IF('Water Quality Compliance'!C10=\"OK.\",\"\",\"D.A. B Errors!\")","v":""},{"$f":"IF('Water Quality Compliance'!D10=\"OK.\",\"\",\"D.A. C Errors!\")","v":""},{"$f":"IF('Water Quality Compliance'!E10=\"OK.\",\"\",\"D.A. D Errors!\")","v":""},{"$f":"IF('Water Quality Compliance'!F10=\"OK.\",\"\",\"D.A. E Errors!\")","v":""}]
[null,"Drainage Area Compliance Summary"]
[]
[null,null,"D.A. A","D.A. B","D.A. C","D.A. D","D.A. E","Total"]
[null,"TP Load Reduced (lb/yr)",{"$f":"'D.A. A'!I116","v":0},{"$f":"'D.A. B'!I116","v":0},{"$f":"'D.A. C'!I116","v":0},{"$f":"'D.A. D'!I116","v":0},{"$f":"'D.A. E'!I116","v":0},{"$f":"SUM(C62:G62)","v":0}]
[null,"TN Load Reduced (lb/yr)",{"$f":"'D.A. A'!I123","v":0},{"$f":"'D.A. B'!I123","v":0},{"$f":"'D.A. C'!I123","v":0},{"$f":"'D.A. D'!I123","v":0},{"$f":"'D.A. E'!I123","v":0},{"$f":"SUM(C63:G63)","v":0}]
[]
[]
[]
[]
[]
[]
[]
[]
[]
[]
[]
[]
[null,"Runoff Volume and CN Calculations"]
[]
[null,null,"1-year storm","2-year storm ","10-year storm "]
[null,"Target Rainfall Event (in)",{"$f":"'Runoff Volume and CN'!$E$6","v":0},{"$f":"'Runoff Volume and CN'!$F$6","v":0},{"$f":"'Runoff Volume and CN'!$G$6","v":0}]
[]
[null,"Drainage Areas","RV & CN","Drainage Area A","Drainage Area B","Drainage Area C","Drainage Area D","Drainage Area E"]
[null,"CN",null,{"$f":"'Runoff Volume and CN'!$H$33","v":0},{"$f":"'Runoff Volume and CN'!$H$49","v":0},{"$f":"'Runoff Volume and CN'!$H$65","v":0},{"$f":"'Runoff Volume and CN'!$H$81","v":0},{"$f":"'Runoff Volume and CN'!$H$97","v":0}]
[null,"RR (ft3)",null,{"$f":"'D.A. A'!$F$71","v":0},{"$f":"'D.A. B'!$F$71","v":0},{"$f":"'D.A. C'!$F$71","v":0},{"$f":"'D.A. D'!$F$71","v":0},{"$f":"'D.A. E'!$F$71","v":0}]
[null,"1-year return period","RV wo RR (ws-in)",{"$f":"'Runoff Volume and CN'!$E$35","v":0},{"$f":"'Runoff Volume and CN'!$E$51","v":0},{"$f":"'Runoff Volume and CN'!$E$67","v":0},{"$f":"'Runoff Volume and CN'!$E$83","v":0},{"$f":"'Runoff Volume and CN'!$E$99","v":0}]
[null,null,"RV w RR (ws-in)",{"$f":"'Runoff Volume and CN'!$E$36","v":0},{"$f":"'Runoff Volume and CN'!$E$52","v":0},{"$f":"'Runoff Volume and CN'!$E$68","v":0},{"$f":"'Runoff Volume and CN'!$E$84","v":0},{"$f":"'Runoff Volume and CN'!$E$100","v":0}]
[null,null,"CN adjusted",{"$f":"'Runoff Volume and CN'!$E$37","v":0},{"$f":"'Runoff Volume and CN'!$E$53","v":0},{"$f":"'Runoff Volume and CN'!$E$69","v":0},{"$f":"'Runoff Volume and CN'!$E$85","v":0},{"$f":"'Runoff Volume and CN'!$E$101","v":0}]
[null,"2-year return period","RV wo RR (ws-in)",{"$f":"'Runoff Volume and CN'!$F$35","v":0},{"$f":"'Runoff Volume and CN'!$F$51","v":0},{"$f":"'Runoff Volume and CN'!$F$67","v":0},{"$f":"'Runoff Volume and CN'!$F$83","v":0},{"$f":"'Runoff Volume and CN'!$F$99","v":0}]
[null,null,"RV w RR (ws-in)",{"$f":"'Runoff Volume and CN'!$F$36","v":0},{"$f":"'Runoff Volume and CN'!$F$52","v":0},{"$f":"'Runoff Volume and CN'!$F$68","v":0},{"$f":"'Runoff Volume and CN'!$F$84","v":0},{"$f":"'Runoff Volume and CN'!$F$100","v":0}]
[null,null,"CN adjusted",{"$f":"'Runoff Volume and CN'!$F$37","v":0},{"$f":"'Runoff Volume and CN'!$F$53","v":0},{"$f":"'Runoff Volume and CN'!$F$69","v":0},{"$f":"'Runoff Volume and CN'!$F$85","v":0},{"$f":"'Runoff Volume and CN'!$F$101","v":0}]
[null,"10-year return period","RV wo RR (ws-in)",{"$f":"'Runoff Volume and CN'!$G$35","v":0},{"$f":"'Runoff Volume and CN'!$G$51","v":0},{"$f":"'Runoff Volume and CN'!$G$67","v":0},{"$f":"'Runoff Volume and CN'!$G$83","v":0},{"$f":"'Runoff Volume and CN'!$G$99","v":0}]
[null,null,"RV w RR (ws-in)",{"$f":"'Runoff Volume and CN'!$G$36","v":0},{"$f":"'Runoff Volume and CN'!$G$52","v":0},{"$f":"'Runoff Volume and CN'!$G$68","v":0},{"$f":"'Runoff Volume and CN'!$G$84","v":0},{"$f":"'Runoff Volume and CN'!$G$100","v":0}]
[null,null,"CN adjusted",{"$f":"'Runoff Volume and CN'!$G$37","v":0},{"$f":"'Runoff Volume and CN'!$G$53","v":0},{"$f":"'Runoff Volume and CN'!$G$69","v":0},{"$f":"'Runoff Volume and CN'!$G$85","v":0},{"$f":"'Runoff Volume and CN'!$G$101","v":0}]

{"sheet":"Constants","index":11,"n_rows":102,"n_cols":11,"rows_kept":102,"cut":false,"hidden":false,"merged":[]}
["Constants",null,null,null,null,null,"VRRM 4.1, 2024"]
["Target Rainfall Event (inches)",1]
["Target TP Load (lb/acre/yr)",0.26]
[]
["Runoff Coefficients (Rv)",null,null,null,null,null,"Curve Numbers (CN)"]
[null,"A Soils","B Soils","C Soils","D Soils",null,null,"A Soils","B Soils","C Soils","D Soils"]
["Forest",0.02,0.03,0.04,0.05,null,"Forest",30,55,70,77]
["Mixed Open",0.08,0.11,0.13,0.15,null,"Mixed Open",34,59,72,79]
["Managed Turf",0.15,0.2,0.22,0.25,null,"Managed Turf",39,61,74,80]
["Impervious Cover",0.95,0.95,0.95,0.95,null,"Impervious Cover ",98,98,98,98]
[]
["Phosphorus Loading Rates (lb/acre/yr)"]
[null,"A Soils","B Soils","C Soils","D Soils"]
["Forest",4.2000000000000003E-2,6.2E-2,8.3000000000000004E-2,0.104]
["Mixed Open",0.23899999999999999,0.34100000000000003,0.38500000000000001,0.45400000000000001]
["Managed Turf",0.50800000000000001,0.67700000000000005,0.745,0.84599999999999997]
["Impervious Cover",0.85799999999999998,0.85799999999999998,0.85799999999999998,0.85799999999999998]
[]
["NitrogenLoading Rates (lb/acre/yr)"]
[null,"A Soils","B Soils","C Soils","D Soils"]
["Forest",0.70199999999999996,1.054,1.405,1.756]
["Mixed Open",1.091,1.5589999999999999,1.76,2.0750000000000002]
["Managed Turf",5.4050000000000002,7.2069999999999999,7.9279999999999999,9.0090000000000003]
["Impervious Cover",12.334,12.334,12.334,12.334]
[]
["Practice","Runoff Reduction Credit (%)","Phosphorus Removal Efficiency (%)","Nitrogen Removal Efficiency (%)"]
["1. Vegetated Roof (RR)"]
["1.a. Vegetated Roof #1 (Spec #5)",45,0,0]
["1.b. Vegetated Roof #2 (Spec #5)",60,0,0]
[]
["2. Rooftop Disconnection (RR)"]
["2.a. Simple Disconnection to A/B Soils \n(Spec #1)",50,0,0]
["2.b. Simple Disconnection to C/D Soils \n(Spec #1)",25,0,0]
["2.c. To Soil Amended Filter Path as per specifications (existing C/D soils) (Spec #4)",50,0,0]
["2.d. To Dry Well or French Drain #1, \nMicro-Infilration #1 (Spec #8)",50,25,15]
["2.e. To Dry Well or French Drain #2, \nMicro-Infiltration #2 (Spec #8)",90,25,15]
["2.f. To Rain Garden #1, \nMicro-Bioretention #1 (Spec #9)",40,25,40]
["2.g. To Rain Garden #2, \nMicro-Bioretention #2 (Spec #9)",80,50,60]
["2.h. To Rainwater Harvesting (Spec #6)","Enter on DA Tab",0,0]
["2.i. To Stormwater Planter, \nUrban Bioretention (Spec #9, Appendix A)",40,25,40]
[]
["3. Permeable Pavement  (RR)"]
["3.a. Permeable Pavement #1 (Spec #7)",45,25,25]
["3.b. Permeable Pavement #2 (Spec #7)",75,25,25]
[]
["4. Grass Channel (RR)"]
["4.a. Grass Channel A/B Soils (Spec #3)",20,15,20]
["4.b. Grass Channel C/D Soils (Spec #3)",10,15,20]
["4.c. Grass Channel with Compost Amended Soils as per specs (see Spec #4)",{"$f":"IF(Site!$J$11=\"2011 Stds & Specs\",30,20)","v":20},15,20]
[]
["5. Dry Swale (RR)"]
["5.a. Dry Swale #1 (Spec #10)",40,20,25]
["5.b. Dry Swale #2 (Spec #10)",60,40,35]
[]
["6. Bioretention (RR)"]
["6.a. Bioretention #1 or Micro-Bioretention #1 or Urban Bioretention (Spec #9)",40,25,40]
["6.b. Bioretention #2 or Micro-Bioretention #2 (Spec #9)",80,50,60]
[]
["7. Infiltration (RR)"]
["7.a. Infiltration #1 (Spec #8)",50,25,15]
["7.b. Infiltration #2 (Spec #8)",90,25,15]
[]
["8. Extended Detention Pond (RR)"]
["8.a. ED #1 (Spec #15)",0,15,10]
["8.b. ED #2 (Spec #15)",15,15,10]
[]
["9. Sheetflow to Filter/Open Space (RR)"]
["9.a. Sheetflow to Conservation Area, A/B Soils (Spec #2)",75,0,0]
["9.b. Sheetflow to Conservation Area, C/D Soils (Spec #2)",50,0,0]
["9.c. Sheetflow to Vegetated Filter Strip, A Soils or Compost Amended B/C/D Soils \n(Spec #2 & #4)",50,0,0]
[]
["10. Regenerative Stormwater Conveyance (RR)"]
["10.a. Regenerative Stormwater Conveyance (P-CNV-04)",0,20,25]
["10.b. Regenerative Stormwater Conveyance (P-CNV-04)",0,40,35]
[]
["11. Trees (RR)"]
["11.a. Trees over Pervious, A/B (P-FIL-09)",16,0,0]
["11.b. Trees over Pervious, C/D (P-FIL-09)",12,0,0]
["11.c. Trees over Impervious (P-FIL-09)",3.5,0,0]
[]
["12. Wet Swale (no RR)"]
["12.a. Wet Swale #1 (Spec #11)",0,20,25]
["12.b. Wet Swale #2 (Spec #11)",0,40,35]
[]
["13.  Filtering Practices (no RR)"]
["13.a.Filtering Practice #1 (Spec #12)",0,60,30]
["13.b. Filtering Practice #2 (Spec #12)",0,65,45]
[]
["14. Constructed Wetland (no RR)"]
["14.a.Constructed Wetland #1 (Spec #13)",0,50,25]
["14.b. Constructed Wetland #2 (Spec #13)",0,75,55]
[]
["15. Wet Ponds (no RR)"]
["15.a. Wet Pond #1 (Spec #14)",0,50,30]
["15.b. Wet Pond #1 (Coastal Plain) (Spec #14)",0,45,20]
["15.c. Wet Pond #2 (Spec #14)",0,75,40]
["15.d. Wet Pond #2 (Coastal Plain) (Spec #14)",0,65,30]
[]
["16. Manufactured Treatment Devices (no RR)"]
["16.a. Manufactured Treatment Device-Hydrodynamic",0,"Enter on DA Tab","Enter on DA Tab"]
["16.b. Manufactured Treatment Device-Filtering",0,"Enter on DA Tab","Enter on DA Tab"]
["16.c. Manufactured Treatment Device-Generic",0,"Enter on DA Tab","Enter on DA Tab"]

{"sheet":"Notes","index":12,"n_rows":84,"n_cols":2,"rows_kept":84,"cut":false,"hidden":false,"merged":[[16,1,16,14],[20,1,20,17]]}
[]
["Version 2.8 - June 2014 - 2011 BMP Stds & Specs"]
[]
[1,"Fixed summary sheet - totals /percentage column fixed"]
[2,"Corrected nitrogen efficiency percentages"]
[3,"Corrected the Rv value in column J for managed turf"]
[4,"Checked and revised runoff reduction credit values assigned"]
[]
["Version 3.0 - 2011 and draft 2013 BMP Stds & Specs"]
["General"]
[1,"Added error checks and user prompts to Site tab, DA tabs, and Runoff Volume and CN tab for data input errors."]
[{"$f":"A11+1","v":2},"Various format changes thoughout the spreadsheet."]
[{"$f":"A12+1","v":3},"Combined 2011 and 2013 BMP spreadsheets into one spreadsheet with a user selection option included in Site tab (row 2)."]
[{"$f":"A13+1","v":4},"User input cell color changed from cyan blue to green; calculation cells changed from mid-grey to light grey; and added final result cell in indigo."]
["Site tab"]
[{"$f":"A14+1","v":5},"Locked annual rainfall of 43 inches for use throughout Virginia since regulatory site based TP load limit is based on this value."]
[{"$f":"A16+1","v":6},"Corrected error in formula for summation of nitrogen removal from runoff reduction practices for each Drainage Area tab (cell V79). "]
[7,"Added button and shortcut (Ctrl+Shift+R) to clear user inputs from all worksheets."]
[8,"Added shortcut (Ctrl+Shift+D) to clear land cover data from Site tab."]
[9,"Added data entry instruction when user inputs blank (row 8)."]
[{"$f":"A20+1","v":10},"Moved and revised TP load reduction requirement (now in blue) to columns A to H, rows 27-30. "]
["D.A. tabs"]
[{"$f":"A21+1","v":11},"Added MTDs: Hydrodynamic, Filtering, Generic."]
[{"$f":"A23+1","v":12},"Added \"Total BMP Treatment Volume (ft3)\" column."]
[{"$f":"A24+1","v":13},"Rearranged previous Turf and Impervious input rows to adjacent cells in same row so each practice now located in one row. "]
[14,"Consolidated BMP Practice heading and added (RR or no RR label) to each practice to identify those with and without Runoff Reduction."]
[15,"Added  \" Total Phosphorus Available for Removal in D.A. _ (lbs)\"."]
[16,"Added button to clear BMP credit areas entered for each practice."]
[17,"Added user prompts to assist with user-input Rainwater Harvesting runoff reduction credit, and MTDs."]
[{"$f":"A29+1","v":18},"Renamed Credit and Phosphorus/Nitrogen Efficiency column headers to Runoff Removal Credit and Phosphorus/Nitrogen Removal Efficiency for clarity."]
[19,"Removed \"RR\" from Column headings referring to runoff volume and TP load from upstream practices (which may be RR or non-RR practices)."]
[20,"Renamed \"10. Wet Swale (Coastal Plain)\" to \"10. Wet Swale\" in BMP heading in order to improve clarity. The practice is well suited for but not limited to the Coastal Plain."]
[{"$f":"A32+1","v":21},"Renamed \"14. Manufactured BMPs\" section heading to \"14. Manufactured Treatment Device\"s for consistency with Virginia BMP Clearinghouse."]
[{"$f":"A33+1","v":22},"Added \"Micro-Bioretention #1\" and \"Micro-Bioretention #2\" to Bioretention headings (6.a and 6.b on tab, respectively) from Spec 9."]
[{"$f":"A34+1","v":23},"Replaced zero values from all data entry cells with blank cells, blocked out calculation and data entry cells where input or calculations are not applicable."]
["Water Quality Compliance tab"]
[{"$f":"A35+1","v":24},"Optimized and reorganized for improved information output."]
[{"$f":"A37+1","v":25},"Added \"Runoff Reduction Volume and TP By Drainage Area\"."]
[{"$f":"A38+1","v":26},"Made correction to site volume carried forward from Site tab. (08/22/2017)"]
["Runoff Volume and CN tab"]
[{"$f":"A39+1","v":27},"Reorganized and renamed Channel and Flood Protection tab to Runoff Volume and CN to more accurately reflect information provided."]
[{"$f":"A41+1","v":28},"Added user notes regarding limitations of Runoff Volume and CN tab for water quantity calculations."]
[{"$f":"A42+1","v":29},"Renamed CNweighted to CN(D.A. X) for the CNs based on soils and land cover types for each drainage area"]
["Summary tab"]
[{"$f":"A43+1","v":30},"Added \"Print Preview\" button."]
[{"$f":"A45+1","v":31},"Fixed runtime error in Summary tab update macro."]
[{"$f":"A46+1","v":32},"Added \"BMP Treatment Volume\",  \"TP Load from Upstream practice\", \"TP Removed\" and \"TP remaining\" columns to Summary tab."]
[33,"Optimized macro efficiency and eliminated screen updating/flashing during macros."]
[34,"Corrected Summary tab macro -Turf missing routine missing \"<>\"."]
[35,"Added Error Summary Table to Summary tab (appears only if errors on Site tab or Drainage Area tabs are present)"]
[36,"Expanded and improved Runoff Coefficient and CN calculation section."]
[37,"Macro glitch with MS Excel 2016 corrected. (08/22/2017)"]
[38,"Added Project Title and Date from Site tab. (8/22/2017)"]
[]
["Version 4.0 - 2024 BMP Stds & Specs - For Review"]
["General"]
[1,"Created a new tab called Constants and moved all constant values to that tab. Constants in all other tabs reference this new sheet."]
[{"$f":"A57+1","v":2},"Separated \"Forest/Open Space\" category into \"Forest\" and \"Mixed Open\" - See VRRM User Guide for additional details."]
[3,"All nutrient calculations were updated to utilize loading rates instead of the SIMPLE Method used in previous versions of the spreadsheet."]
[4,"The option for use of the 2011 Specifications was removed from the spreadsheet.  Specifications updated with Virginia Stormwater Handbook (expected 2024) to be incorporated."]
[{"$f":"A60+1","v":5},"The algorithm for calculating the adjusted predevelopment loads/Rvs was updated to include the mixed open land cover (Re-development spreadsheet, only)."]
["Site tab"]
[{"$f":"A61+1","v":6},"Post-Development Requirements section and Nitrogen Loads section moved to just below the Land Cover table. "]
[{"$f":"A63+1","v":7},"Constants table and Runoff Coefficients table removed. Values for target rainfall, total phosphorus, total nitrgoen, and Pj removed from spreadsheet entirely."]
[8,"Rows added to Land Cover, Post-Development Land Cover, and Land Cover Summary sections, for new land use classification Mixed Open.  Utilize DEQ guidance documents for definition of uses that qualify as mixed open category."]
["D.A. tabs"]
[{"$f":"A65+1","v":9},"Rows added to Land Cover and Total Cover Treated sections for new land use classification, Mixed Open. \"Forest/Open Space\" was renamed to \"Forest\""]
[{"$f":"A67+1","v":10},"Columns added after Land Cover Rv column for Composite Loading P and Composite Loading N. Values were calculated by multiplying land cover areas by their respective loading rates on the Constants sheet."]
[{"$f":"A68+1","v":11},"Untreated Phosphorus Load and Untreated Nitrogen Load were calculated by multiplying each land cover total for a BMP type by the composite loading rate."]
[12,"Regenerative Stormwater Conveyance and Tree BMPs were integrated"]
["Water Quality Compliance tab"]
[13,"Rows added for each Area Check table for Mixed Open area and Mixed Open area treated. \"Forest/Open Space\" was renamed to \"Forest\""]
["Runoff Volume and CN tab"]
[{"$f":"A72+1","v":14},"Rows added for each Drainage Area table for Mixed Open. \"Forest/Open Space\" was renamed to \"Forest\""]
["Summary tab"]
[{"$f":"A74+1","v":15},"Rows added for each Land Cover Summary table for Mixed Open. \"Forest/Open Space\" was renamed to \"Forest\""]
[]
[]
["Version 4.1 - 2024 "]
["General"]
[1,"Adjustments to loading rate constants based on updated model data"]
[2,"Adjustment to nutrient target constant based on newest guidance"]
[3,"Modifications to efficiency values for Trees and Regenerative Stormwater Conveyance (RSC) bmps"]
[4,"Note: RSC bmp efficiency values are still under review. Runoff reduction efficiency "]