{"text_format":"1","workbook":"xlsx","n_sheets":13,"sheets":["Summary_BU","VHid","Site","D.A. A","D.A. B","D.A. C","D.A. D","D.A. E","Water Quality Compliance","Runoff Volume and CN","Summary","Constants","Notes"],"not_rendered":{"charts":0,"images":0,"macros":1,"external_links":0,"defined_names":2,"comments":5,"pivot_tables":0},"unopened":[],"bounds":{"document_bytes":16777216,"sheet_cells":100000,"rows_first":2000,"rows_last":500,"rows_between":2000,"halvings":0,"cell_chars":16384,"cell_head_chars":4096},"cells_cut":0,"cells_raw":0,"read":"whole","date_system":"1900"}

{"sheet":"Summary_BU","index":0,"n_rows":192,"n_cols":11,"rows_kept":192,"cut":false,"hidden":true,"merged":[[5,8,8,9],[6,2,6,3],[27,2,27,3],[28,2,28,3],[29,2,29,3],[7,2,7,3],[48,1,48,2],[183,1,185,1],[186,1,188,1],[189,1,191,1],[4,1,4,4],[5,1,5,4],[30,2,30,3],[32,2,32,3],[34,2,34,5],[35,2,35,5],[39,1,40,2],[39,3,40,3]]}
[]
[null,{"$f":"Site!E1","v":"DEQ Virginia Runoff Reduction Method Re-Development Compliance Spreadsheet  - Version 4.1 "}]
[]
[null,{"$f":"Site!G11","v":"BMP Design Specifications List:"},{"$f":"Site!J11","v":"2024 Stds & Specs"}]
[null,{"$f":"IF(Site!E6=\"Yes\",\"Site Summary - Linear Development Project***\",\"Site Summary\")","v":"Site Summary"}]
[null,{"$f":"IF(Site!B4=\"\",\"Project Title: NA\",\"Project Title: \" &Site!B4)","v":"Project Title: NA"}]
[null,{"$f":"IF(Site!B5=\"\",\"Date: NA\",\"Date: \" &Site!B5)","v":"Date: NA"}]
[null,null,"Total Disturbed Acreage: ",null,{"$f":"Site!F10","v":0}]
{"$rows_left_out":185}
{"sheet":"VHid","index":1,"n_rows":1,"n_cols":1,"rows_kept":1,"cut":false,"hidden":true,"merged":[]}
["VRRMsafe2023"]

{"sheet":"Site","index":2,"n_rows":70,"n_cols":27,"rows_kept":70,"cut":false,"hidden":false,"merged":[[3,1,3,4],[4,1,4,4],[7,1,7,5],[9,2,9,4],[9,7,9,8],[10,6,10,8],[11,3,11,4],[12,6,12,8],[12,10,12,12],[13,10,13,12],[66,0,66,1],[68,0,69,2],[68,4,68,5],[69,7,69,8],[13,6,13,8],[36,1,36,2],[36,7,36,8],[39,0,39,2],[39,4,39,11],[14,7,14,9],[32,3,32,5],[33,3,33,5],[35,1,35,9],[31,2,31,7],[41,7,41,8],[41,4,41,5],[41,0,41,2],[41,10,41,11],[42,10,42,11],[61,4,61,11],[61,0,61,2],[42,4,42,5],[42,7,42,8]]}
[null,null,null,null,"DEQ Virginia Runoff Reduction Method Re-Development Compliance Spreadsheet  - Version 4.1 ",null,null,null,null,null,null,null,null,null,null,"#errors"]
[null,null,null,null,null,null,null,null,null,null,null,null,null,null,"Check Areas!",{"$f":"IF(OR(F21=0,F29=0),\"\",COUNTIF(B29:E29,\"Check Areas!\"))","v":""},null,null,"Yes"]
[null,null,null,null,null,null,null,null,null,null,null,null,null,null,"ENTER TOTAL DISTURBED AREA ABOVE!",{"$f":"IF(F10>0,0,IF(OR(F21=0,F29=0),\"\",1))","v":""},null,null,"No"]
["Project Name: ",null,null,null,null,null,null,null,null,null,null,null,null,null,"ENTER LAND COVER AREAS!"]
["Date: ",null,null,null,null,null,null,null,null,null,null,null,null,null,"Total errors",{"$f":"IF(AND(P2=\"\",P3=\"\"),0,IF(OR(P2=\"\",P3=\"\"),\"incomplete\",IF(P2+P3=0,0,P2+P3)))","v":0}]
[null,null,null,"Linear Development Project?","No"]
["Site Information"]
[null,{"$f":"IF(AND($F$10=0,$F$21=0,$F$29=0),\"ENTER AREAS IN DATA INPUT CELLS FOR RESULTS\",\"\")","v":"ENTER AREAS IN DATA INPUT CELLS FOR RESULTS"}]
{"$rows_left_out":63}
{"sheet":"D.A. A","index":3,"n_rows":340,"n_cols":24,"rows_kept":340,"cut":false,"hidden":false,"merged":[[64,14,64,15],[100,14,100,15],[101,14,101,15],[102,14,102,15],[91,14,91,15],[94,14,94,15],[95,14,95,15],[96,14,96,15],[97,14,97,15],[99,0,99,1],[80,16,80,17],[82,14,82,15],[83,14,83,15],[86,14,86,15],[87,14,87,15],[90,14,90,15],[80,1,80,2],[55,14,55,15],[58,14,58,15],[59,14,59,15],[62,14,62,15],[63,14,63,15],[54,14,54,15],[33,14,33,15],[34,14,34,15],[37,14,37,15],[38,14,38,15],[41,14,41,15],[42,14,42,15],[45,14,45,15],[46,14,46,15],[49,14,49,15],[50,14,50,15],[53,14,53,15],[32,14,32,15],[17,14,17,15],[18,14,18,15],[19,14,19,15],[20,14,20,15],[21,14,21,15],[22,14,22,15],[23,14,23,15],[24,14,24,15],[25,14,25,15],[28,14,28,15],[29,14,29,15],[14,14,14,15],[0,3,0,4],[7,9,7,12],[8,9,8,12],[11,14,11,15],[13,14,13,15],[10,14,10,15]]}
["Drainage Area A",null,null,null,null,null,null,null,null,null,null,null,null,"VRRM 4.1, 2024"]
[]
["Drainage Area A Land Cover  (acres)"]
[null,"A Soils","B Soils","C Soils","D Soils","Totals","Land Cover Rv","Composite Loading P",null,null,null,null,null,null,null,null,null,"Composite Loading N"]
["Forest (acres)",null,null,null,null,{"$f":"SUMIF(B5:E5,\">=0\")","v":0},{"$f":"IF(F5>0,(B5*Constants!$B$7+C5*Constants!$C$7+D5*Constants!$D$7+E5*Constants!$E$7)/F5,0)","v":0},{"$f":"IF(G5>0,(B5*Constants!$B14/F5)+(C5*Constants!$C14/F5)+(D5*Constants!$D14/F5)+(E5*Constants!$E14/F5),0)","v":0},null,null,null,null,null,null,null,null,null,{"$f":"IF(G5>0,(B5*Constants!$B21/F5)+(C5*Constants!$C21/F5)+(D5*Constants!$D21/F5)+(E5*Constants!$E21/F5),0)","v":0}]
["Mixed Open (acres)",null,null,null,null,{"$f":"SUMIF(B6:E6,\">=0\")","v":0},{"$f":"IF(F6>0,(B6*Constants!$B$8+C6*Constants!$C$8+D6*Constants!$D$8+E6*Constants!$E$8)/F6,0)","v":0},{"$f":"IF(G6>0,(B6*Constants!$B15/F6)+(C6*Constants!$C15/F6)+(D6*Constants!$D15/F6)+(E6*Constants!$E15/F6),0)","v":0},null,null,null,null,null,null,null,null,null,{"$f":"IF(G6>0,(B6*Constants!$B22/F6)+(C6*Constants!$C22/F6)+(D6*Constants!$D22/F6)+(E6*Constants!$E22/F6),0)","v":0}]
["Managed Turf (acres)",null,null,null,null,{"$f":"SUMIF(B7:E7,\">=0\")","v":0},{"$f":"IF(F7>0,(B7*Constants!$B$9+C7*Constants!$C$9+D7*Constants!$D$9+E7*Constants!$E$9)/F7,0)","v":0},{"$f":"IF(G7>0,(B7*Constants!$B16/F7)+(C7*Constants!$C16/F7)+(D7*Constants!$D16/F7)+(E7*Constants!$E16/F7),0)","v":0},null,null,null,null,null,null,null,null,null,{"$f":"IF(G7>0,(B7*Constants!$B23/F7)+(C7*Constants!$C23/F7)+(D7*Constants!$D23/F7)+(E7*Constants!$E23/F7),0)","v":0}]
["Impervious Cover (acres) ",null,null,null,null,{"$f":"SUMIF(B8:E8,\">=0\")","v":0},{"$f":"IF(F8>0,(B8*Constants!$B$10+C8*Constants!$C$10+D8*Constants!$D$10+E8*Constants!$E$10)/F8,0)","v":0},{"$f":"IF(G8>0,(B8*Constants!$B17/F8)+(C8*Constants!$C17/F8)+(D8*Constants!$D17/F8)+(E8*Constants!$E17/F8),0)","v":0},null,"     Total Phosphorus Available for Removal in D.A. A (lb/yr)",null,null,null,{"$f":"SUMPRODUCT(B6:E8,Constants!B15:E17)","v":0},null,null,null,{"$f":"IF(G8>0,(B8*Constants!$B24/F8)+(C8*Constants!$C24/F8)+(D8*Constants!$D24/F8)+(E8*Constants!$E24/F8),0)","v":0}]
{"$rows_left_out":333}
{"sheet":"D.A. B","index":4,"n_rows":340,"n_cols":24,"rows_kept":340,"cut":false,"hidden":false,"merged":[[64,14,64,15],[100,14,100,15],[101,14,101,15],[102,14,102,15],[91,14,91,15],[94,14,94,15],[95,14,95,15],[96,14,96,15],[97,14,97,15],[99,0,99,1],[80,16,80,17],[82,14,82,15],[83,14,83,15],[86,14,86,15],[87,14,87,15],[90,14,90,15],[80,1,80,2],[55,14,55,15],[58,14,58,15],[59,14,59,15],[62,14,62,15],[63,14,63,15],[54,14,54,15],[33,14,33,15],[34,14,34,15],[37,14,37,15],[38,14,38,15],[41,14,41,15],[42,14,42,15],[45,14,45,15],[46,14,46,15],[49,14,49,15],[50,14,50,15],[53,14,53,15],[32,14,32,15],[17,14,17,15],[18,14,18,15],[19,14,19,15],[20,14,20,15],[21,14,21,15],[22,14,22,15],[23,14,23,15],[24,14,24,15],[25,14,25,15],[28,14,28,15],[29,14,29,15],[14,14,14,15],[0,3,0,4],[7,9,7,12],[8,9,8,12],[11,14,11,15],[13,14,13,15],[10,14,10,15]]}
["Drainage Area B",null,null,null,null,null,null,null,null,null,null,null,null,"VRRM 4.1, 2024"]
[]
["Drainage Area B Land Cover  (acres)"]
[null,"A Soils","B Soils","C Soils","D Soils","Totals","Land Cover Rv","Composite Loading P",null,null,null,null,null,null,null,null,null,"Composite Loading N"]
["Forest (acres)",null,null,null,null,{"$f":"SUMIF(B5:E5,\">=0\")","v":0},{"$f":"IF(F5>0,(B5*Constants!$B$7+C5*Constants!$C$7+D5*Constants!$D$7+E5*Constants!$E$7)/F5,0)","v":0},{"$f":"IF(G5>0,(B5*Constants!$B14/F5)+(C5*Constants!$C14/F5)+(D5*Constants!$D14/F5)+(E5*Constants!$E14/F5),0)","v":0},null,null,null,null,null,null,null,null,null,{"$f":"IF(G5>0,(B5*Constants!$B21/F5)+(C5*Constants!$C21/F5)+(D5*Constants!$D21/F5)+(E5*Constants!$E21/F5),0)","v":0}]
["Mixed Open (acres)",null,null,null,null,{"$f":"SUMIF(B6:E6,\">=0\")","v":0},{"$f":"IF(F6>0,(B6*Constants!$B$8+C6*Constants!$C$8+D6*Constants!$D$8+E6*Constants!$E$8)/F6,0)","v":0},{"$f":"IF(G6>0,(B6*Constants!$B15/F6)+(C6*Constants!$C15/F6)+(D6*Constants!$D15/F6)+(E6*Constants!$E15/F6),0)","v":0},null,null,null,null,null,null,null,null,null,{"$f":"IF(G6>0,(B6*Constants!$B22/F6)+(C6*Constants!$C22/F6)+(D6*Constants!$D22/F6)+(E6*Constants!$E22/F6),0)","v":0}]
["Managed Turf (acres)",null,null,null,null,{"$f":"SUMIF(B7:E7,\">=0\")","v":0},{"$f":"IF(F7>0,(B7*Constants!$B$9+C7*Constants!$C$9+D7*Constants!$D$9+E7*Constants!$E$9)/F7,0)","v":0},{"$f":"IF(G7>0,(B7*Constants!$B16/F7)+(C7*Constants!$C16/F7)+(D7*Constants!$D16/F7)+(E7*Constants!$E16/F7),0)","v":0},null,null,null,null,null,null,null,null,null,{"$f":"IF(G7>0,(B7*Constants!$B23/F7)+(C7*Constants!$C23/F7)+(D7*Constants!$D23/F7)+(E7*Constants!$E23/F7),0)","v":0}]
["Impervious Cover (acres) ",null,null,null,null,{"$f":"SUMIF(B8:E8,\">=0\")","v":0},{"$f":"IF(F8>0,(B8*Constants!$B$10+C8*Constants!$C$10+D8*Constants!$D$10+E8*Constants!$E$10)/F8,0)","v":0},{"$f":"IF(G8>0,(B8*Constants!$B17/F8)+(C8*Constants!$C17/F8)+(D8*Constants!$D17/F8)+(E8*Constants!$E17/F8),0)","v":0},null,"     Total Phosphorus Available for Removal in D.A. B (lb/yr)",null,null,null,{"$f":"SUMPRODUCT(B6:E8,Constants!B15:E17)","v":0},null,null,null,{"$f":"IF(G8>0,(B8*Constants!$B24/F8)+(C8*Constants!$C24/F8)+(D8*Constants!$D24/F8)+(E8*Constants!$E24/F8),0)","v":0}]
{"$rows_left_out":333}
{"sheet":"D.A. C","index":5,"n_rows":340,"n_cols":24,"rows_kept":340,"cut":false,"hidden":false,"merged":[[64,14,64,15],[100,14,100,15],[101,14,101,15],[102,14,102,15],[91,14,91,15],[94,14,94,15],[95,14,95,15],[96,14,96,15],[97,14,97,15],[99,0,99,1],[80,16,80,17],[82,14,82,15],[83,14,83,15],[86,14,86,15],[87,14,87,15],[90,14,90,15],[80,1,80,2],[55,14,55,15],[58,14,58,15],[59,14,59,15],[62,14,62,15],[63,14,63,15],[54,14,54,15],[33,14,33,15],[34,14,34,15],[37,14,37,15],[38,14,38,15],[41,14,41,15],[42,14,42,15],[45,14,45,15],[46,14,46,15],[49,14,49,15],[50,14,50,15],[53,14,53,15],[32,14,32,15],[17,14,17,15],[18,14,18,15],[19,14,19,15],[20,14,20,15],[21,14,21,15],[22,14,22,15],[23,14,23,15],[24,14,24,15],[25,14,25,15],[28,14,28,15],[29,14,29,15],[14,14,14,15],[0,3,0,4],[7,9,7,12],[8,9,8,12],[11,14,11,15],[13,14,13,15],[10,14,10,15]]}
["Drainage Area C",null,null,null,null,null,null,null,null,null,null,null,null,"VRRM 4.1, 2024"]
[]
["Drainage Area C Land Cover  (acres)"]
[null,"A Soils","B Soils","C Soils","D Soils","Totals","Land Cover Rv","Composite Loading P",null,null,null,null,null,null,null,null,null,"Composite Loading N"]
["Forest (acres)",null,null,null,null,{"$f":"SUMIF(B5:E5,\">=0\")","v":0},{"$f":"IF(F5>0,(B5*Constants!$B$7+C5*Constants!$C$7+D5*Constants!$D$7+E5*Constants!$E$7)/F5,0)","v":0},{"$f":"IF(G5>0,(B5*Constants!$B14/F5)+(C5*Constants!$C14/F5)+(D5*Constants!$D14/F5)+(E5*Constants!$E14/F5),0)","v":0},null,null,null,null,null,null,null,null,null,{"$f":"IF(G5>0,(B5*Constants!$B21/F5)+(C5*Constants!$C21/F5)+(D5*Constants!$D21/F5)+(E5*Constants!$E21/F5),0)","v":0}]
["Mixed Open (acres)",null,null,null,null,{"$f":"SUMIF(B6:E6,\">=0\")","v":0},{"$f":"IF(F6>0,(B6*Constants!$B$8+C6*Constants!$C$8+D6*Constants!$D$8+E6*Constants!$E$8)/F6,0)","v":0},{"$f":"IF(G6>0,(B6*Constants!$B15/F6)+(C6*Constants!$C15/F6)+(D6*Constants!$D15/F6)+(E6*Constants!$E15/F6),0)","v":0},null,null,null,null,null,null,null,null,null,{"$f":"IF(G6>0,(B6*Constants!$B22/F6)+(C6*Constants!$C22/F6)+(D6*Constants!$D22/F6)+(E6*Constants!$E22/F6),0)","v":0}]
["Managed Turf (acres)",null,null,null,null,{"$f":"SUMIF(B7:E7,\">=0\")","v":0},{"$f":"IF(F7>0,(B7*Constants!$B$9+C7*Constants!$C$9+D7*Constants!$D$9+E7*Constants!$E$9)/F7,0)","v":0},{"$f":"IF(G7>0,(B7*Constants!$B16/F7)+(C7*Constants!$C16/F7)+(D7*Constants!$D16/F7)+(E7*Constants!$E16/F7),0)","v":0},null,null,null,null,null,null,null,null,null,{"$f":"IF(G7>0,(B7*Constants!$B23/F7)+(C7*Constants!$C23/F7)+(D7*Constants!$D23/F7)+(E7*Constants!$E23/F7),0)","v":0}]
["Impervious Cover (acres) ",null,null,null,null,{"$f":"SUMIF(B8:E8,\">=0\")","v":0},{"$f":"IF(F8>0,(B8*Constants!$B$10+C8*Constants!$C$10+D8*Constants!$D$10+E8*Constants!$E$10)/F8,0)","v":0},{"$f":"IF(G8>0,(B8*Constants!$B17/F8)+(C8*Constants!$C17/F8)+(D8*Constants!$D17/F8)+(E8*Constants!$E17/F8),0)","v":0},null,"     Total Phosphorus Available for Removal in D.A. C (lb/yr)",null,null,null,{"$f":"SUMPRODUCT(B6:E8,Constants!B15:E17)","v":0},null,null,null,{"$f":"IF(G8>0,(B8*Constants!$B24/F8)+(C8*Constants!$C24/F8)+(D8*Constants!$D24/F8)+(E8*Constants!$E24/F8),0)","v":0}]
{"$rows_left_out":333}
{"sheet":"D.A. D","index":6,"n_rows":340,"n_cols":24,"rows_kept":340,"cut":false,"hidden":false,"merged":[[64,14,64,15],[100,14,100,15],[101,14,101,15],[102,14,102,15],[91,14,91,15],[94,14,94,15],[95,14,95,15],[96,14,96,15],[97,14,97,15],[99,0,99,1],[80,16,80,17],[82,14,82,15],[83,14,83,15],[86,14,86,15],[87,14,87,15],[90,14,90,15],[80,1,80,2],[55,14,55,15],[58,14,58,15],[59,14,59,15],[62,14,62,15],[63,14,63,15],[54,14,54,15],[33,14,33,15],[34,14,34,15],[37,14,37,15],[38,14,38,15],[41,14,41,15],[42,14,42,15],[45,14,45,15],[46,14,46,15],[49,14,49,15],[50,14,50,15],[53,14,53,15],[32,14,32,15],[17,14,17,15],[18,14,18,15],[19,14,19,15],[20,14,20,15],[21,14,21,15],[22,14,22,15],[23,14,23,15],[24,14,24,15],[25,14,25,15],[28,14,28,15],[29,14,29,15],[14,14,14,15],[0,3,0,4],[7,9,7,12],[8,9,8,12],[11,14,11,15],[13,14,13,15],[10,14,10,15]]}
["Drainage Area D",null,null,null,null,null,null,null,null,null,null,null,null,"VRRM 4.1, 2024"]
[]
["Drainage Area D Land Cover  (acres)"]
[null,"A Soils","B Soils","C Soils","D Soils","Totals","Land Cover Rv","Composite Loading P",null,null,null,null,null,null,null,null,null,"Composite Loading N"]
["Forest (acres)",null,null,null,null,{"$f":"SUMIF(B5:E5,\">=0\")","v":0},{"$f":"IF(F5>0,(B5*Constants!$B$7+C5*Constants!$C$7+D5*Constants!$D$7+E5*Constants!$E$7)/F5,0)","v":0},{"$f":"IF(G5>0,(B5*Constants!$B14/F5)+(C5*Constants!$C14/F5)+(D5*Constants!$D14/F5)+(E5*Constants!$E14/F5),0)","v":0},null,null,null,null,null,null,null,null,null,{"$f":"IF(G5>0,(B5*Constants!$B21/F5)+(C5*Constants!$C21/F5)+(D5*Constants!$D21/F5)+(E5*Constants!$E21/F5),0)","v":0}]
["Mixed Open (acres)",null,null,null,null,{"$f":"SUMIF(B6:E6,\">=0\")","v":0},{"$f":"IF(F6>0,(B6*Constants!$B$8+C6*Constants!$C$8+D6*Constants!$D$8+E6*Constants!$E$8)/F6,0)","v":0},{"$f":"IF(G6>0,(B6*Constants!$B15/F6)+(C6*Constants!$C15/F6)+(D6*Constants!$D15/F6)+(E6*Constants!$E15/F6),0)","v":0},null,null,null,null,null,null,null,null,null,{"$f":"IF(G6>0,(B6*Constants!$B22/F6)+(C6*Constants!$C22/F6)+(D6*Constants!$D22/F6)+(E6*Constants!$E22/F6),0)","v":0}]
["Managed Turf (acres)",null,null,null,null,{"$f":"SUMIF(B7:E7,\">=0\")","v":0},{"$f":"IF(F7>0,(B7*Constants!$B$9+C7*Constants!$C$9+D7*Constants!$D$9+E7*Constants!$E$9)/F7,0)","v":0},{"$f":"IF(G7>0,(B7*Constants!$B16/F7)+(C7*Constants!$C16/F7)+(D7*Constants!$D16/F7)+(E7*Constants!$E16/F7),0)","v":0},null,null,null,null,null,null,null,null,null,{"$f":"IF(G7>0,(B7*Constants!$B23/F7)+(C7*Constants!$C23/F7)+(D7*Constants!$D23/F7)+(E7*Constants!$E23/F7),0)","v":0}]
["Impervious Cover (acres) ",null,null,null,null,{"$f":"SUMIF(B8:E8,\">=0\")","v":0},{"$f":"IF(F8>0,(B8*Constants!$B$10+C8*Constants!$C$10+D8*Constants!$D$10+E8*Constants!$E$10)/F8,0)","v":0},{"$f":"IF(G8>0,(B8*Constants!$B17/F8)+(C8*Constants!$C17/F8)+(D8*Constants!$D17/F8)+(E8*Constants!$E17/F8),0)","v":0},null,"     Total Phosphorus Available for Removal in D.A. D (lb/yr)",null,null,null,{"$f":"SUMPRODUCT(B6:E8,Constants!B15:E17)","v":0},null,null,null,{"$f":"IF(G8>0,(B8*Constants!$B24/F8)+(C8*Constants!$C24/F8)+(D8*Constants!$D24/F8)+(E8*Constants!$E24/F8),0)","v":0}]
{"$rows_left_out":333}
{"sheet":"D.A. E","index":7,"n_rows":340,"n_cols":24,"rows_kept":340,"cut":false,"hidden":false,"merged":[[64,14,64,15],[100,14,100,15],[101,14,101,15],[102,14,102,15],[91,14,91,15],[94,14,94,15],[95,14,95,15],[96,14,96,15],[97,14,97,15],[99,0,99,1],[80,16,80,17],[82,14,82,15],[83,14,83,15],[86,14,86,15],[87,14,87,15],[90,14,90,15],[80,1,80,2],[55,14,55,15],[58,14,58,15],[59,14,59,15],[62,14,62,15],[63,14,63,15],[54,14,54,15],[33,14,33,15],[34,14,34,15],[37,14,37,15],[38,14,38,15],[41,14,41,15],[42,14,42,15],[45,14,45,15],[46,14,46,15],[49,14,49,15],[50,14,50,15],[53,14,53,15],[32,14,32,15],[17,14,17,15],[18,14,18,15],[19,14,19,15],[20,14,20,15],[21,14,21,15],[22,14,22,15],[23,14,23,15],[24,14,24,15],[25,14,25,15],[28,14,28,15],[29,14,29,15],[14,14,14,15],[0,3,0,4],[7,9,7,12],[8,9,8,12],[11,14,11,15],[13,14,13,15],[10,14,10,15]]}
["Drainage Area E",null,null,null,null,null,null,null,null,null,null,null,null,"VRRM 4.1, 2024"]
[]
["Drainage Area E Land Cover  (acres)"]
[null,"A Soils","B Soils","C Soils","D Soils","Totals","Land Cover Rv","Composite Loading P",null,null,null,null,null,null,null,null,null,"Composite Loading N"]
["Forest (acres)",null,null,null,null,{"$f":"SUMIF(B5:E5,\">=0\")","v":0},{"$f":"IF(F5>0,(B5*Constants!$B$7+C5*Constants!$C$7+D5*Constants!$D$7+E5*Constants!$E$7)/F5,0)","v":0},{"$f":"IF(G5>0,(B5*Constants!$B14/F5)+(C5*Constants!$C14/F5)+(D5*Constants!$D14/F5)+(E5*Constants!$E14/F5),0)","v":0},null,null,null,null,null,null,null,null,null,{"$f":"IF(G5>0,(B5*Constants!$B21/F5)+(C5*Constants!$C21/F5)+(D5*Constants!$D21/F5)+(E5*Constants!$E21/F5),0)","v":0}]
["Mixed Open (acres)",null,null,null,null,{"$f":"SUMIF(B6:E6,\">=0\")","v":0},{"$f":"IF(F6>0,(B6*Constants!$B$8+C6*Constants!$C$8+D6*Constants!$D$8+E6*Constants!$E$8)/F6,0)","v":0},{"$f":"IF(G6>0,(B6*Constants!$B15/F6)+(C6*Constants!$C15/F6)+(D6*Constants!$D15/F6)+(E6*Constants!$E15/F6),0)","v":0},null,null,null,null,null,null,null,null,null,{"$f":"IF(G6>0,(B6*Constants!$B22/F6)+(C6*Constants!$C22/F6)+(D6*Constants!$D22/F6)+(E6*Constants!$E22/F6),0)","v":0}]
["Managed Turf (acres)",null,null,null,null,{"$f":"SUMIF(B7:E7,\">=0\")","v":0},{"$f":"IF(F7>0,(B7*Constants!$B$9+C7*Constants!$C$9+D7*Constants!$D$9+E7*Constants!$E$9)/F7,0)","v":0},{"$f":"IF(G7>0,(B7*Constants!$B16/F7)+(C7*Constants!$C16/F7)+(D7*Constants!$D16/F7)+(E7*Constants!$E16/F7),0)","v":0},null,null,null,null,null,null,null,null,null,{"$f":"IF(G7>0,(B7*Constants!$B23/F7)+(C7*Constants!$C23/F7)+(D7*Constants!$D23/F7)+(E7*Constants!$E23/F7),0)","v":0}]
["Impervious Cover (acres) ",null,null,null,null,{"$f":"SUMIF(B8:E8,\">=0\")","v":0},{"$f":"IF(F8>0,(B8*Constants!$B$10+C8*Constants!$C$10+D8*Constants!$D$10+E8*Constants!$E$10)/F8,0)","v":0},{"$f":"IF(G8>0,(B8*Constants!$B17/F8)+(C8*Constants!$C17/F8)+(D8*Constants!$D17/F8)+(E8*Constants!$E17/F8),0)","v":0},null,"     Total Phosphorus Available for Removal in D.A. E (lb/yr)",null,null,null,{"$f":"SUMPRODUCT(B6:E8,Constants!B15:E17)","v":0},null,null,null,{"$f":"IF(G8>0,(B8*Constants!$B24/F8)+(C8*Constants!$C24/F8)+(D8*Constants!$D24/F8)+(E8*Constants!$E24/F8),0)","v":0}]
{"$rows_left_out":333}
{"sheet":"Water Quality Compliance","index":8,"n_rows":33,"n_cols":23,"rows_kept":33,"cut":false,"hidden":false,"merged":[[27,4,28,7],[28,0,28,2],[16,21,16,22]]}
["Site Results (Water Quality Compliance) VRRM 4.1, 2024",null,null,null,null,null,null,null,null,null,null,null,null,null,null,null,null,null,null,"error summary"]
["Area Checks","D.A. A","D.A. B","D.A. C","D.A. D","D.A. E","AREA CHECK",null,null,null,null,null,null,null,null,null,null,null,null,"Area checks",{"$f":"COUNTIF(G8:G9,\"AREA EXCEEDED!\")","v":0}]
["FOREST (ac)",{"$f":"'D.A. A'!$F$5","v":0},{"$f":"'D.A. B'!$F$5","v":0},{"$f":"'D.A. C'!$F$5","v":0},{"$f":"'D.A. D'!$F$5","v":0},{"$f":"'D.A. E'!$F$5","v":0},{"$f":"IF(SUM(B3:F3)>Site!$F$25,\"AREA EXCEEDED!\",\"OK.\")","v":"OK."},null,null,null,null,null,null,null,null,null,null,null,null,"DA checks",{"$f":"COUNTIF(G9:G10,\"AREA EXCEEDED!\")","v":0}]
["MIXED OPEN (ac)",{"$f":"'D.A. A'!$F$6","v":0},{"$f":"'D.A. B'!$F$6","v":0},{"$f":"'D.A. C'!$F$6","v":0},{"$f":"'D.A. D'!$F$6","v":0},{"$f":"'D.A. E'!$F$6","v":0},{"$f":"IF(SUM(B4:F4)>Site!$F$26,\"AREA EXCEEDED!\",\"OK.\")","v":"OK."}]
["MIXED OPEN AREA TREATED(ac)",{"$f":"'D.A. A'!$F$108","v":0},{"$f":"'D.A. B'!$F$108","v":0},{"$f":"'D.A. C'!$F$108","v":0},{"$f":"'D.A. D'!$F$108","v":0},{"$f":"'D.A. E'!$F$108","v":0},{"$f":"IF(SUM(B5:F5)>SUM('D.A. A'!$F$6,'D.A. B'!$F$6,'D.A. C'!$F$6,'D.A. D'!$F$6,'D.A. E'!$F$6),\"AREA EXCEEDED!\",\"OK.\")","v":"OK."}]
["MANAGED TURF AREA (ac)",{"$f":"'D.A. A'!$F$7","v":0},{"$f":"'D.A. B'!$F$7","v":0},{"$f":"'D.A. C'!$F$7","v":0},{"$f":"'D.A. D'!$F$7","v":0},{"$f":"'D.A. E'!$F$7","v":0},{"$f":"IF(SUM(B6:F6)>Site!$F$27,\"AREA EXCEEDED!\",\"OK.\")","v":"OK."}]
["MANAGED TURF AREA TREATED (ac)",{"$f":"'D.A. A'!$F$109","v":0},{"$f":"'D.A. B'!$F$109","v":0},{"$f":"'D.A. C'!$F$109","v":0},{"$f":"'D.A. D'!$F$109","v":0},{"$f":"'D.A. E'!$F$109","v":0},{"$f":"IF(SUM(B7:F7)>SUM('D.A. A'!$F$7,'D.A. B'!$F$7,'D.A. C'!$F$7,'D.A. D'!$F$7,'D.A. E'!$F$7),\"AREA EXCEEDED!\",\"OK.\")","v":"OK."}]
["IMPERVIOUS COVER (ac)",{"$f":"'D.A. A'!$F$8","v":0},{"$f":"'D.A. B'!$F$8","v":0},{"$f":"'D.A. C'!$F$8","v":0},{"$f":"'D.A. D'!$F$8","v":0},{"$f":"'D.A. E'!$F$8","v":0},{"$f":"IF(SUM(B8:F8)>Site!$F$28,\"AREA EXCEEDED!\",\"OK.\")","v":"OK."},null,null,null,null,null,null,null,null,null,null,null,null,"total",{"$f":"SUM(U2:U3)","v":0}]
{"$rows_left_out":26}
{"sheet":"Runoff Volume and CN","index":9,"n_rows":666,"n_cols":28,"rows_kept":666,"cut":false,"hidden":false,"merged":[[29,1,30,2],[25,1,26,2],[3,4,3,6],[6,1,6,2],[7,1,7,3],[9,1,11,10],[12,1,15,10],[16,1,17,10],[20,1,20,11],[22,1,22,2],[23,1,24,2],[23,9,24,9],[27,1,28,2],[55,9,56,9],[34,1,34,3],[35,1,35,3],[38,1,38,2],[39,1,40,2],[39,9,40,9],[43,1,44,2],[41,1,42,2],[45,1,46,2],[50,1,50,3],[51,1,51,3],[54,1,54,2],[55,1,56,2],[91,1,92,2],[93,1,94,2],[98,1,98,3],[99,1,99,3],[71,9,72,9],[75,1,76,2],[77,1,78,2],[82,1,82,3],[83,1,83,3],[86,1,86,2],[71,1,72,2],[57,1,58,2],[73,1,74,2],[89,1,90,2],[87,1,88,2],[87,9,88,9],[59,1,60,2],[61,1,62,2],[66,1,66,3],[67,1,67,3],[70,1,70,2]]}
[]
[null,null,null,null,null,"Runoff Volume and Curve Number Calculations, VRRM 4.1, 2024",null,null,null,null,null,null,null,"These values are used for",null,null," Range  :  1               2                 3                4                 5                 6                7  "]
[null,null,null,null,null,null,null,null,null,null,null,null,null,"computing \"qu\" by equation",null,null,"  Ia / P :",0.1,0.3,0.35,0.4,0.45,0.5]
[null,null,null,null,"Enter design storm rainfall depths (in):",null,null,null,null,null,null,null,null,"in Appendix F of TR-55.",null,null,"C0 :",2.5532300000000001,2.4653200000000002,2.4189600000000002,2.36409,2.2923800000000001,2.20282]
[null,null,null,null,"1-year storm","2-year storm","10-year storm",null,null,null,null,null,null,"The formulas automatically",null,null,"C1 :",-0.61512,-0.62256999999999996,-0.61594000000000004,-0.59857000000000005,-0.57004999999999995,-0.51598999999999995]
[null,null,null,{"$f":"IF(SUM(E6:G6)=0,\"→\",\"\")","v":"→"},0,0,0,{"$f":"IF(SUM(E6:G6)=0,\"←\",\"\")","v":"←"},null,null,null,null,null,"interpolate for C0, C1 & C2.",null,null,"C2 :",-0.16403000000000001,-0.11656999999999999,-8.8200000000000001E-2,-5.6210000000000003E-2,-2.281E-2,-1.259E-2]
[]
[]
{"$rows_left_out":659}
{"sheet":"Summary","index":10,"n_rows":92,"n_cols":11,"rows_kept":92,"cut":false,"hidden":false,"merged":[[89,1,91,1],[83,1,85,1],[86,1,88,1],[4,1,4,4],[5,1,5,4],[6,2,6,3],[30,2,30,3],[32,2,32,3],[34,2,34,5],[35,2,35,5],[39,1,40,2],[39,3,40,3],[48,1,48,2],[5,8,8,9],[7,2,7,3],[27,2,27,3],[28,2,28,3],[29,2,29,3]]}
[]
[null,{"$f":"Site!E1","v":"DEQ Virginia Runoff Reduction Method Re-Development Compliance Spreadsheet  - Version 4.1 "}]
[]
[null,{"$f":"Site!G11","v":"BMP Design Specifications List:"},{"$f":"Site!J11","v":"2024 Stds & Specs"}]
[null,{"$f":"IF(Site!E6=\"Yes\",\"Site Summary - Linear Development Project***\",\"Site Summary\")","v":"Site Summary"}]
[null,{"$f":"IF(Site!B4=\"\",\"Project Title: NA\",\"Project Title: \" &Site!B4)","v":"Project Title: NA"}]
[null,{"$f":"IF(Site!B5=\"\",\"Date: NA\",\"Date: \" &Site!B5)","v":"Date: NA"}]
[null,null,"Total Disturbed Acreage: ",null,{"$f":"Site!F10","v":0}]
{"$rows_left_out":85}
{"sheet":"Constants","index":11,"n_rows":102,"n_cols":11,"rows_kept":102,"cut":false,"hidden":false,"merged":[]}
["Constants",null,null,null,null,null,"VRRM 4.1, 2024"]
["Target Rainfall Event (inches)",1]
["Target TP Load (lb/acre/yr)",0.26]
[]
["Runoff Coefficients (Rv)",null,null,null,null,null,"Curve Numbers (CN)"]
[null,"A Soils","B Soils","C Soils","D Soils",null,null,"A Soils","B Soils","C Soils","D Soils"]
["Forest",0.02,0.03,0.04,0.05,null,"Forest",30,55,70,77]
["Mixed Open",0.08,0.11,0.13,0.15,null,"Mixed Open",34,59,72,79]
{"$rows_left_out":95}
{"sheet":"Notes","index":12,"n_rows":84,"n_cols":2,"rows_kept":84,"cut":false,"hidden":false,"merged":[[16,1,16,14],[20,1,20,17]]}
[]
["Version 2.8 - June 2014 - 2011 BMP Stds & Specs"]
[]
[1,"Fixed summary sheet - totals /percentage column fixed"]
[2,"Corrected nitrogen efficiency percentages"]
[3,"Corrected the Rv value in column J for managed turf"]
[4,"Checked and revised runoff reduction credit values assigned"]
[]
{"$rows_left_out":76}